program: Gaussian 09
title: 000150570
version: EM64L-G09RevD.01
frameworkgroup: C1[X(C17H18N4O2)]
method: RPBEPBE
basis: SDD
operation: Freq
keyword: #p
keyword: freq=noraman
keyword: PBEPBE/SDD
title: #p freq=noraman PBEPBE/SDD
converged: YES YES NO NO
title: Mulliken charges:
elementType: O O N N N N C C C C C C C C C C C C C C C C C H H H H H H H H H H H H H H H H H H
charge: -0.252239 -0.313473 -0.268432 -0.111288 -0.380057 -0.165502 0.110387 0.076806 -0.352546 -0.395362 0.090712 0.181422 0.107810 0.157536 -0.117032 -0.251586 -0.240232 -0.318903 -0.357622 -0.606363 -0.618960 -0.251450 -0.199204 0.185053 0.225258 0.227525 0.253508 0.430088 0.295604 0.299519 0.240682 0.270307 0.281477 0.231248 0.196492 0.213981 0.220371 0.192113 0.244381 0.235727 0.232244
chargesum: 0.00000
title: Mulliken charges with hydrogens summed into heavy atoms:
elementType: O O N N N N C C C C C C C C C C C C C C C C C
charge: -0.252239 -0.313473 -0.268432 -0.111288 0.050030 -0.165502 0.110387 0.076806 0.057766 0.085671 0.090712 0.181422 0.107810 0.157536 0.178572 0.047932 0.000450 -0.048596 -0.076145 0.035358 0.037905 -0.015722 0.033040
polarizability: 2.75387412e+02 6.27906007e+00 3.26780098e+02 5.53970863e-01 5.37560686e-01 1.07551804e+02
1716.lowfreq: -9.4445 -3.0122 -0.0009 -0.0008 0.0005 5.0498 17.9412 35.9814 47.8998
frequency: 17.5496 35.8215 47.8972 54.6692 70.2395 82.5045 90.8141 120.9895 150.3609 187.6300 207.7354 218.2857 230.1593 252.4428 269.9506 295.0273 301.4022 309.9766 326.6601 341.8495 357.9964 372.5957 417.2831 428.6542 432.1376 474.7066 492.2668 519.7892 536.3613 546.1516 573.8932 606.7466 630.3805 671.7010 677.8681 702.8705 722.0800 752.8227 758.9974 776.8817 791.9405 820.8885 827.7805 853.4323 879.7758 895.9768 899.0491 936.1066 953.4569 960.3017 970.9344 986.6512 998.4097 1005.6431 1022.8430 1032.1996 1048.2969 1057.7035 1065.8357 1084.2296 1093.8020 1102.9756 1122.1341 1139.7607 1155.4204 1168.2004 1172.8725 1187.4832 1218.3208 1237.9727 1247.0524 1262.3782 1265.9219 1270.1510 1281.0502 1299.2546 1350.4644 1368.3767 1374.5371 1396.6412 1413.3092 1418.6600 1440.1351 1451.7105 1458.4861 1460.5443 1462.9388 1472.4463 1475.7532 1486.0032 1490.7886 1507.9765 1515.7348 1548.4451 1558.5234 1585.1023 1610.8795 1625.9110 1644.0871 2851.3813 2861.1169 2875.3131 2965.9286 3019.1679 3028.2023 3035.3492 3046.8519 3078.3831 3091.2394 3133.1629 3140.7061 3147.6639 3155.4394 3157.5121 3171.4982 3177.3619 3196.6952
redmass: 3.7427 3.2611 4.7313 4.3832 5.4981 4.8146 4.0591 4.4212 5.3044 3.1617 5.2674 1.5301 1.1842 3.2749 4.0494 4.3125 2.3490 4.3189 7.3462 4.7874 4.1605 2.6523 2.1169 4.0358 5.2861 4.5050 7.2133 3.4647 3.2785 8.7431 3.5326 7.9695 6.8178 6.1405 6.6821 5.6320 4.1707 3.7299 3.8552 1.9670 1.8460 1.8164 3.8730 5.9881 2.9154 6.0505 1.4432 3.7409 1.0906 3.0515 1.3126 1.3590 1.3679 1.3234 2.1037 1.5785 1.8180 2.0959 1.9924 1.9692 2.0326 2.0492 3.1501 1.5991 1.3626 1.1753 1.6748 2.2374 2.2806 1.5144 2.6512 2.2953 2.2549 2.2327 1.4725 2.2524 1.3612 1.4858 2.3242 7.1354 2.2520 1.1458 1.1587 2.6916 1.1159 1.1571 2.0063 1.0893 1.0852 1.0540 1.0732 3.2142 3.0816 7.1991 7.7854 7.7765 6.2363 8.9125 7.8827 1.0694 1.0561 1.0569 1.0687 1.0739 1.0865 1.0746 1.0940 1.1010 1.1002 1.0863 1.0853 1.0895 1.0909 1.0961 1.1002 1.0894 1.1002
irintensity: 0.1085 0.0016 0.1738 0.2141 6.0000 7.0036 0.9593 0.3046 0.3497 0.8804 1.1545 0.2860 0.1455 0.6681 8.9936 12.2877 3.9402 1.9500 1.0534 43.8051 3.6653 0.4320 0.0957 2.5186 1.6720 0.5224 0.1501 0.6795 5.3959 2.3342 9.1767 1.3688 5.5560 25.5580 7.0446 4.9331 1.3012 26.8944 23.3914 80.8980 4.0010 26.9510 1.6213 2.4543 7.0480 6.6670 0.0309 25.2640 66.3302 13.0907 0.0084 5.4645 2.5339 0.6220 6.3858 17.1977 26.4343 18.5202 10.9705 15.7481 14.9626 3.2984 26.8471 7.5474 17.9547 1.0087 3.3297 19.6925 3.5416 24.7915 2.3676 31.9461 7.2195 22.7717 11.8734 14.9702 11.2169 0.7016 8.9302 68.1861 16.4977 5.6337 7.4172 28.9986 7.5606 22.8317 140.8785 9.0010 15.3519 16.4911 43.5833 389.9428 257.6804 61.3124 25.6030 111.5939 119.1535 287.4967 140.0465 63.3855 63.3550 305.1320 61.3821 35.7982 26.5254 35.7543 26.9858 32.2728 26.0877 9.6169 408.5623 4.6178 1.0110 6.2228 25.7406 18.0866 6.8204
temp: 298.150 k
press: 1.00000 atm
elementType: 8 8 7 7 7 7 6 6 6 6 6 6 6 6 6 6 6 6 6 6 6 6 6 1 1 1 1 1 1 1 1 1 1 1 1 1 1 1 1 1 1
symmnumber: 1
zpe: 853121.5 jmol-1
zpe.correction: 0.324937 hartree
zpe.thermalcorrener: 0.345138 hartree
zpe.thermalcorrenthalpy: 0.346082 hartree
zpe.thermalcorrgfe: 0.274808 hartree
zpe.sumelectzpe: -1026.442624 hartree
zpe.sumelectthermal: -1026.422423 hartree
zpe.sumelectthermalent: -1026.421479 hartree
zpe.sumelectthermalfe: -1026.492752 hartree
dipole: 1.5416 3.3435 -0.0960
dipole: 3.6830
quadrupole: -130.6840 -128.9622 -136.4959
quadrupole: 17.2139 -0.2930 0.3885
quadrupole: 1.3634 3.0852 -4.4486 17.2139 -0.2930 0.3885
hfenergy: -1026.7675608 hartree
pointgroup: C01 [X(C17H18N4O2)]
dipole: 0.2805755 -1.4126984 0.158731 debye
polarizability: 274.9510887|5.4062231|324.9110218|-8.9203321|-20.2412562|109.8572035 unknown
InChI: InChI=1S/C17H18N4O2/c1-20(2)11-9-18-16(22)13-7-5-10-21-15(13)19-14-8-4-3-6-12(14)17(21)23/h3-8,10,18H,9,11H2,1-2H3
charge 0 multiplicity 1
41 atoms
O  -4.243382 0.728012 0.114032
O  2.562438 3.150098 -0.469948
N  -2.003165 1.454139 -0.068537
N  3.354071 -1.907824 0.008255
N  2.327885 0.839712 -0.227231
N  -0.164695 -0.120858 -0.024635
C  -0.605466 1.142299 -0.113852
C  0.31691 2.2592 -0.260188
C  4.108872 -0.718847 0.484708
C  3.765788 0.571652 -0.279767
C  -2.485097 -0.951176 0.173689
C  -3.024076 0.399688 0.079666
C  -1.065834 -1.166318 0.117735
C  1.830291 2.110466 -0.328305
C  -2.468702 2.766258 -0.16127
C  -0.181946 3.556636 -0.351654
C  -1.587591 3.81914 -0.301583
C  -3.368958 -2.058012 0.321542
C  -0.558785 -2.497433 0.212598
C  3.492486 -3.044131 0.946647
C  3.700954 -2.299737 -1.376253
C  -2.855061 -3.357749 0.412952
C  -1.443602 -3.573193 0.357965
H  5.216224 -0.87933 0.418123
H  3.858949 -0.574178 1.552557
H  4.11021 0.511064 -1.332941
H  4.303875 1.427636 0.167291
H  1.636561 0.061207 -0.132479
H  -3.556193 2.858173 -0.112291
H  0.553321 4.360492 -0.463072
H  -1.974975 4.837836 -0.372698
H  -4.44506 -1.860618 0.360859
H  0.527903 -2.627953 0.168406
H  3.136772 -2.746432 1.948883
H  4.545997 -3.408427 1.04603
H  2.875101 -3.892384 0.599208
H  3.087971 -3.168336 -1.675418
H  4.778968 -2.576854 -1.494169
H  3.478029 -1.477187 -2.075744
H  -3.532297 -4.210349 0.526883
H  -1.051595 -4.593882 0.431208
