program: Gaussian 09
title: 000150558
version: EM64L-G09RevD.01
frameworkgroup: C1[X(C16H15N3O)]
method: RPBEPBE
basis: SDD
operation: Freq
keyword: #p
keyword: freq=noraman
keyword: PBEPBE/SDD
title: #p freq=noraman PBEPBE/SDD
converged: YES YES NO NO
title: Mulliken charges:
elementType: O N N N C C C C C C C C C C C C C C C C H H H H H H H H H H H H H H H
charge: -0.306601 -0.155938 -0.378142 -0.576328 -0.093087 0.461367 0.175935 0.403151 -0.461042 -0.035087 -0.418306 -0.360549 0.123563 -0.246258 -0.384650 -0.359061 -0.330288 -0.249836 -0.375517 -0.215948 0.254454 0.239627 0.288935 0.236485 0.238823 0.231736 0.226708 0.257723 0.372674 0.199344 0.224024 0.234552 0.235641 0.274433 0.267464
chargesum: 0.00000
title: Mulliken charges with hydrogens summed into heavy atoms:
elementType: O N N N C C C C C C C C C C C C C C C C
charge: -0.306601 -0.155938 -0.005468 -0.034430 -0.093087 0.461367 0.175935 0.403151 -0.206588 -0.035087 -0.178679 -0.071615 0.123563 -0.009773 -0.145827 0.099383 -0.072565 -0.015284 0.047850 0.019693
polarizability: 2.76843957e+02 3.50927424e+01 2.83623243e+02 -9.81013248e+00 7.86930635e+00 8.95610505e+01
1716.lowfreq: -5.1419 -0.0006 -0.0005 0.0005 3.5984 7.7068 27.3288 41.7414 65.7677
frequency: 27.2952 41.7345 65.7641 83.6675 88.7463 103.0907 122.6071 172.4340 206.3235 230.2216 247.8273 281.9929 285.4931 320.0272 328.3807 344.3639 399.3103 408.4051 475.1734 476.4036 499.7371 522.3567 528.9576 545.6166 586.4687 612.9427 618.7349 638.3067 665.8533 719.2727 734.7792 751.7403 770.6640 770.8148 790.7251 817.4727 828.3639 851.8871 871.2879 906.3061 909.2694 929.1817 947.8240 959.8244 962.4862 973.4540 996.7077 1005.4112 1011.5111 1037.4704 1066.0012 1076.3543 1101.8610 1127.3569 1162.1972 1173.0634 1184.7521 1190.4068 1208.1647 1242.0555 1260.5466 1262.3750 1275.8195 1300.4708 1310.6433 1334.5093 1345.0456 1361.6679 1379.2345 1404.0186 1421.0823 1427.1574 1448.6335 1456.3115 1475.0050 1488.1813 1527.5497 1548.6589 1556.2268 1574.1700 1592.3148 1619.0379 1634.8473 1640.8474 2919.3593 3005.5438 3026.2939 3078.3354 3120.9219 3124.9282 3125.3581 3138.9240 3144.7558 3152.9219 3156.5657 3162.9556 3169.8301 3461.6373 3588.9246
redmass: 3.7020 4.9286 5.5204 3.8793 2.3137 5.2769 3.9836 4.5466 1.5190 2.3833 4.5008 4.1178 3.4527 3.9804 4.7002 7.8277 4.2107 5.6912 2.8891 5.1982 3.7610 4.6137 6.3647 4.9358 3.5596 4.3706 1.4718 5.8089 6.0948 6.4744 2.9959 1.6722 1.7079 2.8324 2.0413 1.8948 2.5617 4.2882 1.5209 6.1434 1.1113 1.5356 1.8853 1.4162 4.7179 1.4149 1.3357 1.3790 2.2362 2.9623 2.2455 2.6259 2.7741 1.8057 1.2484 1.1716 1.5967 1.3876 1.8307 2.9669 1.2885 1.8273 2.3602 1.2014 2.6629 3.8458 1.2431 2.1523 1.3800 2.7551 3.8359 5.5877 1.1215 3.0657 2.9642 1.0864 5.8146 2.0348 6.8474 5.1654 4.8495 6.5941 6.0814 1.0987 1.0687 1.0605 1.0910 1.1058 1.0920 1.0878 1.0878 1.0884 1.0908 1.0880 1.0932 1.0982 1.1005 1.0451 1.0975
irintensity: 1.4394 2.3598 1.2153 1.5575 1.5997 4.8300 5.0824 0.2922 35.5617 26.9198 2.9657 0.6890 0.9488 23.8683 0.7331 11.1192 3.1417 1.2751 11.1943 18.0042 1.3189 6.9191 2.6726 19.8334 0.1997 55.4790 173.5990 2.0852 7.0301 13.5280 2.6871 80.4231 14.9086 2.3356 20.0525 0.9231 1.6111 5.9447 2.0342 2.4977 105.8204 22.1406 4.4786 0.1881 4.2942 12.2240 0.2369 3.1644 6.1079 11.2094 0.1436 9.9642 31.2556 8.8048 0.9406 0.8337 9.3893 6.0078 0.8311 17.4304 9.3427 0.6149 30.3677 1.8873 3.8694 12.2595 1.9614 7.3860 2.9373 8.0222 1.0614 17.0765 17.0847 25.8476 6.4658 5.4630 83.3673 253.0685 66.5441 16.2638 80.4922 90.3618 19.4971 35.3872 62.5976 51.4697 25.5355 31.2228 4.5219 0.4330 16.0434 4.4271 7.0077 534.7287 39.1589 27.1232 27.4472 0.4037 0.7501
temp: 298.150 k
press: 1.00000 atm
elementType: 8 7 7 7 6 6 6 6 6 6 6 6 6 6 6 6 6 6 6 6 1 1 1 1 1 1 1 1 1 1 1 1 1 1 1
symmnumber: 1
zpe: 729892.6 jmol-1
zpe.correction: 0.278001 hartree
zpe.thermalcorrener: 0.294832 hartree
zpe.thermalcorrenthalpy: 0.295776 hartree
zpe.thermalcorrgfe: 0.232456 hartree
zpe.sumelectzpe: -856.810332 hartree
zpe.sumelectthermal: -856.793502 hartree
zpe.sumelectthermalent: -856.792558 hartree
zpe.sumelectthermalfe: -856.855878 hartree
dipole: -5.4289 -0.9960 1.4698
dipole: 5.7118
quadrupole: -103.3883 -102.9116 -120.7083
quadrupole: -7.0432 4.5240 -0.5891
quadrupole: 5.6144 6.0911 -11.7056 -7.0432 4.5240 -0.5891
hfenergy: -857.0883337 hartree
pointgroup: C01 [X(C16H15N3O1)]
dipole: -2.2045495 0.3346523 -0.2791509 debye
polarizability: 281.1418352|-30.5630742|262.2650221|-18.6195778|55.3708306|106.6213936 unknown
InChI: InChI=1S/C16H15N3O/c17-8-9-18-16(20)13-6-3-5-12-10-11-4-1-2-7-14(11)19-15(12)13/h1-7,10,18H,8-9,17H2
charge 0 multiplicity 1
35 atoms
O  3.734151 -1.443624 -0.19222
N  -0.193237 0.199446 0.456125
N  2.494226 0.406294 0.508991
N  5.312174 2.850741 -0.1286
C  -0.028588 -1.086476 0.002328
C  -1.18408 -1.940488 -0.282088
C  1.306644 -1.625632 -0.204105
C  -2.653323 -0.083031 0.386455
C  -2.47916 -1.406597 -0.080121
C  -1.452529 0.702425 0.648391
C  -0.983129 -3.28349 -0.753325
C  1.436626 -2.939579 -0.664617
C  2.610501 -0.877286 0.035219
C  0.305219 -3.771952 -0.939228
C  -3.944091 0.512132 0.611014
C  3.671659 1.238042 0.774563
C  -1.596447 2.051232 1.125706
C  -4.046972 1.820447 1.072941
C  4.110935 2.061309 -0.463456
C  -2.861675 2.594467 1.331969
H  -3.357144 -2.030989 -0.288872
H  -1.859785 -3.908812 -0.960669
H  2.457892 -3.309422 -0.808968
H  0.464723 -4.794345 -1.297096
H  -4.843565 -0.082809 0.412218
H  4.5020 0.572211 1.074911
H  3.458508 1.930873 1.607639
H  -0.68616 2.627168 1.319725
H  1.51738 0.748941 0.639401
H  3.300178 2.762209 -0.738094
H  4.243804 1.355943 -1.315411
H  -5.03064 2.270695 1.243336
H  -2.962622 3.622606 1.696416
H  5.510565 3.6202 -0.773742
H  6.143562 2.27845 0.050263
