program: Gaussian 09
title: 000150544
version: EM64L-G09RevD.01
frameworkgroup: C1[X(C12H15Cl2NO2)]
method: RPBEPBE
basis: SDD
operation: Freq
keyword: #p
keyword: freq=noraman
keyword: PBEPBE/SDD
title: #p freq=noraman PBEPBE/SDD
converged: YES YES NO NO
title: Mulliken charges:
elementType: Cl Cl O O N C C C C C C C C C C C C H H H H H H H H H H H H H H H
charge: -0.023159 -0.020684 -0.278236 -0.237235 -0.227346 -0.407410 -0.245605 0.454674 0.273707 -0.292443 -0.293239 -0.205649 -0.709494 -0.228025 -0.235114 -0.220286 -0.676799 0.277099 0.227118 0.207021 0.202830 0.293194 0.184549 0.196474 0.291562 0.289692 0.260272 0.239756 0.239946 0.204941 0.238664 0.219226
chargesum: 0.00000
title: Mulliken charges with hydrogens summed into heavy atoms:
elementType: Cl Cl O O N C C C C C C C C C C C C
charge: -0.023159 -0.020684 -0.278236 -0.237235 -0.227346 0.096807 0.164246 0.454674 0.273707 -0.292443 -0.000045 0.175374 -0.128240 0.032247 0.004642 0.019659 -0.013969
polarizability: 1.54848124e+02 -3.65480574e+00 1.73961427e+02 1.47743444e+01 1.74712769e+01 1.45511308e+02
1716.lowfreq: -12.1018 -4.8595 0.0020 0.0021 0.0023 4.0902 14.6597 23.9007 27.6099
frequency: 12.6236 23.7341 27.5273 40.4620 59.8346 68.7053 78.7987 105.5871 110.0662 140.8661 171.3009 193.5114 222.3077 235.0471 269.1220 279.5509 305.1827 351.9233 386.2785 414.1810 429.8851 462.7277 476.7139 505.9580 556.0804 585.8666 631.6262 664.8535 727.9267 731.1498 747.0465 770.7393 785.1084 815.9095 875.5222 910.8464 916.1182 923.0609 938.7406 960.5298 993.1871 1020.3317 1023.4213 1035.4199 1064.4238 1092.3309 1098.7120 1121.0065 1121.6966 1140.0903 1161.5902 1171.3491 1201.8213 1229.9285 1246.9597 1253.0348 1271.6522 1282.9563 1333.7253 1346.1001 1358.1110 1371.3775 1390.7481 1404.8193 1419.8625 1423.6055 1454.2854 1459.3935 1469.2226 1472.6838 1480.8672 1495.2234 1568.9261 1593.7783 1628.5897 2914.9262 2924.7263 2965.9060 2968.4096 2987.1270 2994.9045 3047.1919 3081.2881 3091.8718 3102.1092 3124.3233 3137.9790 3149.0023 3162.6600 3176.3821
redmass: 4.9979 4.4367 9.4686 3.8795 1.8308 4.3839 5.7596 4.9781 5.3367 4.7424 3.9139 3.7999 4.6142 1.2012 6.8503 3.5638 3.4433 7.6164 4.2701 3.5549 5.8660 3.5706 5.4849 3.0041 3.3692 3.4453 5.9201 6.6663 5.1989 4.5692 5.3627 1.3072 2.3300 1.0889 1.3627 2.3108 1.9337 3.4240 2.7805 1.3827 1.3494 5.0200 3.1964 2.2271 3.4579 3.2575 2.1880 1.6195 2.1045 1.4941 1.0853 1.0596 1.3080 1.6616 1.5022 1.1563 1.3793 1.8911 1.4904 1.6622 7.9525 1.5855 1.2504 1.4228 1.0933 2.1974 1.2978 1.0416 1.8364 1.1083 1.0623 1.0839 6.4089 7.1015 9.3547 1.0557 1.0554 1.1043 1.1050 1.0678 1.0360 1.0568 1.0959 1.0994 1.1006 1.1074 1.0866 1.0909 1.0954 1.0998
irintensity: 0.4291 0.3114 0.6783 1.2347 2.4185 0.3241 4.6881 8.1273 4.4434 1.2679 2.5127 0.8114 1.9321 1.4329 2.4719 0.9188 1.1041 4.4841 4.0750 4.5442 6.0262 15.0090 3.8876 1.3035 11.8169 9.6306 14.1493 19.6210 44.9631 6.1102 15.3021 67.2684 3.9060 3.7544 0.8065 17.6169 11.6649 2.9988 0.3323 3.2316 1.2811 36.1609 8.9202 16.4061 120.9927 29.0687 21.5683 7.8570 43.0026 14.6158 0.7081 0.3289 82.3678 92.8852 7.3111 0.7845 3.0290 29.9290 56.7593 48.8752 0.2777 11.3587 19.0255 11.7762 15.2580 21.5714 4.8650 10.8057 100.5081 18.6513 2.0837 5.4042 5.2841 28.0621 211.3284 22.3351 105.5270 112.4471 1.6168 52.8919 20.0113 15.2753 5.8910 43.0594 30.5973 2.3928 2.9525 3.0406 7.2905 12.2162
temp: 298.150 k
press: 1.00000 atm
elementType: 17 17 8 8 7 6 6 6 6 6 6 6 6 6 6 6 6 1 1 1 1 1 1 1 1 1 1 1 1 1 1 1
symmnumber: 1
zpe: 651624.2 jmol-1
zpe.correction: 0.248191 hartree
zpe.thermalcorrener: 0.266542 hartree
zpe.thermalcorrenthalpy: 0.267486 hartree
zpe.thermalcorrgfe: 0.197181 hartree
zpe.sumelectzpe: -1590.290277 hartree
zpe.sumelectthermal: -1590.271926 hartree
zpe.sumelectthermalent: -1590.270982 hartree
zpe.sumelectthermalfe: -1590.341287 hartree
dipole: -3.3317 -7.1618 -1.7383
dipole: 8.0878
quadrupole: -105.3657 -124.9384 -109.1102
quadrupole: -5.6994 -1.9931 2.1228
quadrupole: 7.7724 -11.8003 4.0279 -5.6994 -1.9931 2.1228
hfenergy: -1590.538468 hartree
pointgroup: C01 [X(C12H15Cl2N1O2)]
dipole: -0.673506 3.0280713 -0.7086976 debye
polarizability: 164.2802211|-12.9480747|162.4456629|-3.4686798|-21.9954456|147.5949751 unknown
InChI: InChI=1S/C12H15Cl2NO2/c1-2-17-8-7-15(12(16)9-13)11-6-4-3-5-10(11)14/h3-6H,2,7-9H2,1H3
charge 0 multiplicity 1
32 atoms
Cl -2.656137 -0.597315 2.076003
Cl -0.191234 -4.395205 -0.915034
O  2.494204 0.98301 0.162181
O  1.247433 -2.674374 1.098662
N  0.138707 -0.650837 0.745456
C  0.953698 0.025198 1.784884
C  1.63498 1.309399 1.301043
C  -0.857742 0.116848 0.045908
C  0.373913 -2.010363 0.483068
C  -2.182288 0.25148 0.535129
C  -0.518335 0.791351 -1.155701
C  3.322192 2.123803 -0.263739
C  -0.546701 -2.597298 -0.603282
C  -3.152814 1.013237 -0.144242
C  -1.478958 1.555977 -1.85167
C  -2.795654 1.665617 -1.346573
C  4.168063 1.662631 -1.449707
H  1.710634 -0.713743 2.097211
H  0.317206 0.267479 2.659739
H  2.237437 1.715118 2.144567
H  0.891174 2.084746 1.009821
H  0.517534 0.708078 -1.503184
H  2.668793 2.9811 -0.544081
H  3.968072 2.449341 0.581855
H  -1.602689 -2.536464 -0.296992
H  -0.412961 -2.080729 -1.565431
H  -4.167085 1.090695 0.25791
H  -1.201714 2.066132 -2.779911
H  -3.54715 2.256523 -1.880534
H  4.825628 2.480543 -1.79617
H  4.79705 0.803512 -1.160792
H  3.525441 1.350112 -2.291291
