program: Gaussian 09
title: 000150531
version: EM64L-G09RevD.01
frameworkgroup: C1[X(C18H19ClN4O)]
method: RPBEPBE
basis: SDD
operation: Freq
keyword: #p
keyword: freq=noraman
keyword: PBEPBE/SDD
title: #p freq=noraman PBEPBE/SDD
converged: YES YES NO NO
title: Mulliken charges:
elementType: Cl O N N N N C C C C C C C C C C C C C C C C C C H H H H H H H H H H H H H H H H H H H
charge: -0.049354 -0.302345 -0.179863 -0.368299 -0.085954 -0.674720 0.364768 -0.122639 0.187162 0.258544 0.255137 -0.030685 -0.396947 -0.335747 -0.325028 0.125374 -0.354450 -0.188511 -0.338563 -0.337382 -0.283433 -0.223880 -0.618672 -0.617704 0.252484 0.207262 0.176967 0.256077 0.215189 0.375846 0.311668 0.191864 0.255682 0.334729 0.329953 0.233050 0.236470 0.184454 0.217733 0.185279 0.219009 0.224124 0.235348
chargesum: 0.00000
title: Mulliken charges with hydrogens summed into heavy atoms:
elementType: Cl O N N N N C C C C C C C C C C C C C C C C C C
charge: -0.049354 -0.302345 -0.179863 0.007547 -0.085954 -0.010037 0.364768 -0.122639 0.187162 0.258544 0.255137 -0.030685 0.062799 0.097298 -0.109839 0.125374 -0.042782 -0.188511 -0.146699 -0.081700 -0.050383 0.011468 0.019986 0.010708
polarizability: 3.18513275e+02 -4.55658218e+00 3.68841141e+02 1.81609289e+01 2.28468488e+00 1.16113267e+02
1716.lowfreq: -4.5290 -2.2335 0.0010 0.0010 0.0011 4.3371 16.2971 25.8007 29.1192
frequency: 15.6724 25.5682 29.0597 41.3893 65.5280 82.2314 86.0348 115.5463 122.1684 149.2712 163.5701 170.4123 183.6313 211.9733 219.1498 241.9361 262.1521 277.2544 290.5649 331.4979 336.0827 349.7761 357.7997 370.9094 388.4456 402.8693 412.4618 439.4591 468.6845 472.8465 495.7229 510.4119 522.3749 531.7494 560.6195 575.6403 597.6807 650.4868 653.2640 698.1940 713.4061 718.5281 754.3316 766.1679 779.3314 802.0650 820.9909 834.8680 845.3825 846.2697 863.6454 893.9266 928.1408 930.1879 948.5415 955.0005 991.0193 1014.3351 1023.7193 1032.9641 1039.4461 1062.8869 1077.4428 1091.5404 1093.2648 1113.2938 1130.5002 1138.2110 1167.3485 1176.9901 1195.6678 1207.4112 1245.9988 1257.1846 1264.0615 1272.5407 1273.8739 1301.1959 1308.8465 1323.5397 1342.6236 1366.8139 1379.2865 1406.2997 1412.1173 1417.7194 1438.8489 1439.7827 1451.2870 1457.4353 1460.9655 1467.2474 1475.0513 1481.4787 1485.2571 1493.5871 1523.0341 1550.1876 1557.4828 1561.0146 1584.4495 1611.5822 1628.2737 1655.9610 2837.9104 2844.5854 2862.7130 3009.2793 3015.9788 3020.8137 3050.7400 3074.3920 3078.9997 3080.5665 3086.4251 3113.7284 3138.5053 3145.7372 3155.5048 3156.5951 3170.2337 3575.8106 3706.9695
redmass: 3.1184 3.7220 4.2750 6.4952 5.4870 4.8368 2.5850 4.1070 3.7938 7.7057 5.1440 4.2456 3.1827 1.1491 1.6846 2.3512 3.0270 3.8261 10.0164 5.1286 6.0463 2.8015 1.5343 2.7288 3.6824 3.8021 2.7617 3.2942 1.3761 3.9923 6.1083 3.9614 4.2545 3.5443 6.8421 3.3010 5.0051 6.0884 6.0890 3.5874 5.3330 6.2377 1.5502 3.7622 1.7443 2.6014 4.2379 3.1196 1.7908 4.1437 2.0914 6.0089 1.4216 2.1323 1.3602 1.3809 1.3367 3.3649 2.3163 1.5837 3.0039 2.8729 1.6664 1.3960 1.9079 2.4214 1.7306 1.5026 1.7006 1.7103 2.1083 1.5016 2.8073 1.7177 2.1752 2.4525 1.8304 1.2972 3.8090 1.3246 2.2602 1.3268 4.5036 3.3022 6.8323 1.1401 1.1917 2.6887 1.1330 3.3407 1.0542 1.0543 1.0527 1.0892 1.0607 4.3993 6.1662 6.9000 2.5278 4.6038 4.0801 6.2979 5.7327 1.2293 1.0582 1.0640 1.0635 1.0602 1.0725 1.0705 1.0888 1.1017 1.0974 1.0998 1.0943 1.0869 1.0875 1.0911 1.0940 1.0918 1.1005 1.0455 1.1027
irintensity: 0.7490 1.1776 1.9014 0.2348 1.5356 1.9990 0.4878 3.7952 4.7123 0.6302 7.5028 0.0398 0.1537 0.9049 1.2586 3.8661 4.6216 3.4899 3.6411 1.1434 3.1670 13.1239 0.0187 0.6877 18.6636 1.3053 0.5831 7.0785 179.8528 25.5379 2.6956 12.3953 9.7724 5.3960 3.0035 39.9215 11.9400 6.2514 23.4376 18.2095 2.6903 9.2565 71.2915 27.4021 28.6253 5.6171 7.8730 3.6472 23.9701 16.5154 0.6884 9.1047 64.6559 51.9087 9.2460 9.2446 0.9565 13.6626 8.1460 24.9030 29.5329 38.8401 14.4237 6.4882 16.4340 10.3037 16.1329 4.2478 5.2710 6.6182 16.0220 6.6317 14.5703 9.8589 13.6059 54.5475 1.2914 4.0275 26.2474 0.7484 3.3438 0.9852 28.0513 58.0300 5.1284 4.3248 12.1112 18.6954 14.9039 8.3427 12.9531 10.3061 32.5102 12.4480 10.2014 208.5687 155.0225 53.6064 317.8874 66.0027 65.7426 96.4386 17.2571 328.4398 69.6364 84.9347 216.4408 33.9988 43.2953 79.5974 4.3816 23.1877 517.0726 44.1693 216.7429 9.5259 6.4892 5.2949 17.6652 10.5949 27.8934 78.1029 25.6837
temp: 298.150 k
press: 1.00000 atm
elementType: 17 8 7 7 7 7 6 6 6 6 6 6 6 6 6 6 6 6 6 6 6 6 6 6 1 1 1 1 1 1 1 1 1 1 1 1 1 1 1 1 1 1 1
symmnumber: 1
zpe: 890365.2 jmol-1
zpe.correction: 0.339122 hartree
zpe.thermalcorrener: 0.361632 hartree
zpe.thermalcorrenthalpy: 0.362576 hartree
zpe.thermalcorrgfe: 0.285213 hartree
zpe.sumelectzpe: -1449.911311 hartree
zpe.sumelectthermal: -1449.888801 hartree
zpe.sumelectthermalent: -1449.887857 hartree
zpe.sumelectthermalfe: -1449.965220 hartree
dipole: 6.4645 -6.3018 1.8436
dipole: 9.2141
quadrupole: -113.6112 -147.6205 -154.2274
quadrupole: 1.0089 -0.9351 2.8340
quadrupole: 24.8752 -9.1341 -15.7411 1.0089 -0.9351 2.8340
hfenergy: -1450.2504332 hartree
pointgroup: C01[X(C18H19Cl1N4O1)]
dipole: -3.0795352 1.1929948 1.4948872 debye
polarizability: 320.324963|-5.8676951|340.3338298|-40.7241996|68.8223442|142.80889 unknown
InChI: InChI=1S/C18H19ClN4O/c1-23(2)8-7-21-18(24)14-10-11(19)9-13-16(20)12-5-3-4-6-15(12)22-17(13)14/h3-6,9-10,21H,7-8,20H2,1-2H3
charge 0 multiplicity 1
43 atoms
Cl -0.799898 -5.493347 -1.57935
O  2.952121 -1.797054 -1.54418
N  -0.460935 0.338275 -0.070147
N  2.109369 0.245326 -0.787689
N  5.624142 1.422154 0.091764
N  -4.189249 -1.676761 0.353147
C  -1.821761 -1.72233 -0.279089
C  -0.568286 -0.988449 -0.406063
C  0.604386 -1.692897 -0.907139
C  -2.982005 -1.024617 0.216088
C  -2.861829 0.366009 0.566042
C  -1.566038 0.998734 0.400405
C  3.384711 0.954338 -0.94129
C  4.364128 0.658751 0.225958
C  -1.872504 -3.107076 -0.645517
C  1.987785 -1.08272 -1.102629
C  0.506294 -3.043702 -1.251798
C  -0.726031 -3.731412 -1.117098
C  -3.95412 1.152019 1.068153
C  -1.424887 2.387603 0.744401
C  -3.785467 2.496851 1.393076
C  -2.504696 3.120657 1.228537
C  6.777239 0.757483 0.730195
C  5.500357 2.831944 0.507643
H  3.873504 0.638151 -1.879234
H  3.1692 2.036054 -1.006578
H  3.848479 0.858806 1.200341
H  4.596899 -0.419935 0.190576
H  -2.791619 -3.696003 -0.566399
H  1.234703 0.695326 -0.427081
H  1.410794 -3.535883 -1.624329
H  -4.948116 0.709245 1.207396
H  -0.438144 2.841611 0.610045
H  -4.293938 -2.657116 0.111603
H  -5.010974 -1.191402 0.699353
H  -4.629574 3.080649 1.774538
H  6.884695 -0.265165 0.328723
H  6.69311 0.68658 1.845244
H  7.703045 1.314981 0.496549
H  5.285231 2.950048 1.601878
H  4.690148 3.330306 -0.052716
H  6.439808 3.369321 0.284662
H  -2.380877 4.178045 1.486108
