program: Gaussian 09
title: 000150529
version: EM64L-G09RevD.01
frameworkgroup: C1[X(C19H22N4O2)]
method: RPBEPBE
basis: SDD
operation: Freq
keyword: #p
keyword: freq=noraman
keyword: PBEPBE/SDD
title: #p freq=noraman PBEPBE/SDD
converged: YES YES NO NO
title: Mulliken charges:
elementType: O O N N N N C C C C C C C C C C C C C C C C C C C H H H H H H H H H H H H H H H H H H H H H H
charge: -0.248522 -0.304830 -0.177204 -0.369644 -0.086176 -0.682418 0.403435 -0.135711 0.201065 0.256366 0.248352 -0.034946 -0.551709 -0.396771 -0.336699 -0.533435 0.119433 0.312740 -0.344139 -0.339822 -0.285826 -0.227793 -0.619051 -0.618121 -0.536957 0.250476 0.205336 0.201618 0.176933 0.257173 0.310164 0.375465 0.189088 0.253411 0.327388 0.325503 0.229736 0.232556 0.236381 0.183642 0.216611 0.184692 0.219367 0.222908 0.218714 0.218131 0.253086
chargesum: 0.00000
title: Mulliken charges with hydrogens summed into heavy atoms:
elementType: O O N N N N C C C C C C C C C C C C C C C C C C C
charge: -0.248522 -0.304830 -0.177204 0.005821 -0.086176 -0.029527 0.403435 -0.135711 0.201065 0.256366 0.248352 -0.034946 -0.350091 0.059041 0.097408 -0.223271 0.119433 0.312740 -0.155051 -0.086411 -0.056090 0.004763 0.017582 0.008847 0.152974
polarizability: 3.22054869e+02 2.40319749e+00 3.75847659e+02 -1.78580008e+01 -9.49039874e-01 1.24857639e+02
1716.lowfreq: -4.2429 -3.2176 -0.0005 0.0003 0.0004 3.5956 19.2040 23.4375 28.5689
frequency: 18.8774 23.0973 28.5162 37.7102 66.1842 79.2383 85.9358 94.6579 119.8242 126.0239 150.5317 163.8222 178.7509 195.5632 214.5120 219.3336 238.8932 249.8824 265.1322 283.6879 291.4669 334.9997 337.4144 339.4430 353.6591 360.1396 384.8972 398.6212 412.3311 423.5990 445.7831 465.7869 486.9993 509.6703 523.7186 544.5443 549.5028 587.5951 597.6314 602.5140 662.1190 666.5502 705.9928 714.9892 744.8988 752.5705 768.0522 789.6275 794.0358 826.2824 835.2145 837.5761 860.4436 868.0524 902.2060 934.6542 945.7431 946.3603 960.6071 987.6750 1005.5846 1018.2517 1023.8218 1033.2814 1046.3130 1065.8275 1077.4951 1091.6448 1109.0420 1111.7370 1125.0619 1131.9934 1138.8284 1157.9476 1173.7479 1192.5206 1210.1982 1217.5435 1255.3587 1262.3854 1263.2949 1273.5167 1278.9345 1301.4781 1313.2000 1323.4521 1346.1132 1367.6329 1386.4259 1409.9328 1417.2683 1425.5318 1438.3905 1440.2589 1447.7822 1451.3976 1458.2624 1460.5445 1466.7321 1467.4394 1473.4286 1475.1178 1481.6748 1485.5806 1491.2581 1530.4882 1551.2738 1558.7547 1567.4765 1590.2664 1618.9053 1635.3417 1652.7124 2836.4956 2844.5035 2862.9692 2953.2545 3008.6365 3014.7768 3019.8991 3039.7672 3050.9310 3061.5266 3074.1814 3079.6375 3082.4604 3109.3501 3128.5295 3136.1536 3144.7918 3152.8136 3159.4053 3168.2546 3581.6011 3713.7502
redmass: 2.8731 3.8731 4.1119 4.1952 5.4033 3.7042 2.7940 4.1180 3.5732 3.6064 3.5537 2.8197 2.7136 4.1232 1.0970 1.6888 2.5617 1.3233 2.6096 3.8005 4.7840 5.0929 2.9654 1.4828 2.5650 5.4901 4.4296 2.9389 2.6793 1.5319 2.8768 4.3124 4.7994 4.2440 3.9868 5.9644 3.9287 6.2174 2.9411 5.1475 5.2590 5.2799 3.3026 4.1834 3.8663 1.5078 3.7495 2.2489 1.7965 4.2593 2.5788 3.6164 2.1480 5.1440 5.3713 1.1188 3.6056 1.3781 1.4550 1.3331 4.1388 2.9855 2.3718 1.5465 2.7811 2.7674 1.6671 1.3698 2.8753 1.2639 2.0351 1.7967 1.5007 1.4153 1.1848 1.9739 1.5279 3.0529 1.9212 3.0186 2.2482 1.7351 2.4206 1.2474 4.8603 1.3164 2.2191 1.3252 5.1700 4.9518 1.1398 1.5378 1.3084 2.1797 2.2177 1.1804 2.8961 1.0718 1.0511 1.0535 1.1227 1.0536 1.0854 1.0637 3.9516 6.3420 6.7894 2.1603 6.3279 3.7661 6.1956 4.7471 1.3093 1.0581 1.0631 1.0646 1.0335 1.0597 1.0724 1.0705 1.1037 1.0897 1.0899 1.1008 1.1001 1.1020 1.0869 1.0985 1.0873 1.0890 1.0939 1.0914 1.1005 1.0452 1.1025
irintensity: 1.1767 1.2838 3.0550 0.0175 1.8204 4.3477 0.1102 0.9675 5.6222 3.7864 3.6645 1.3718 1.0259 9.6529 1.0232 1.0505 2.5273 0.0017 5.4129 0.2002 13.1161 1.1132 6.9086 7.1477 9.7287 7.0442 8.5269 8.4469 9.2774 118.4143 56.9384 3.8003 5.3050 12.3380 8.9096 5.7020 0.4180 13.4002 49.3539 5.2124 9.1993 3.6277 2.0336 1.1001 2.7009 78.6563 23.2858 20.9007 12.5045 5.8865 15.3571 4.9611 0.0407 1.2676 8.3634 69.6466 10.6534 21.0642 14.3702 1.1281 81.1448 13.9605 6.7445 24.9804 62.9924 15.4968 15.4778 12.0953 15.1266 0.1281 37.0875 16.0424 3.8574 20.6513 7.4390 10.0990 5.0058 77.0671 54.3614 26.8050 11.7317 3.4671 84.0597 1.2476 17.0514 1.0947 9.3083 0.4537 14.7679 14.6102 4.0173 89.6112 1.2588 29.5825 60.1646 23.4014 21.2938 8.2423 14.4985 13.3122 25.7566 29.0568 11.5149 10.4928 171.5208 63.1827 74.7461 386.0057 51.2965 238.3277 3.8626 7.9793 343.9662 70.1951 96.2942 204.6440 60.5780 42.8607 44.9504 82.2908 50.1165 23.8508 718.4347 49.9937 50.5426 15.6687 11.5558 27.2394 6.3093 18.0809 20.5853 7.5113 30.9033 62.4822 22.7591
temp: 298.150 k
press: 1.00000 atm
elementType: 8 8 7 7 7 7 6 6 6 6 6 6 6 6 6 6 6 6 6 6 6 6 6 6 6 1 1 1 1 1 1 1 1 1 1 1 1 1 1 1 1 1 1 1 1 1 1
symmnumber: 1
zpe: 997782.9 jmol-1
zpe.correction: 0.380035 hartree
zpe.thermalcorrener: 0.404002 hartree
zpe.thermalcorrenthalpy: 0.404946 hartree
zpe.thermalcorrgfe: 0.324871 hartree
zpe.sumelectzpe: -1104.873231 hartree
zpe.sumelectthermal: -1104.849265 hartree
zpe.sumelectthermalent: -1104.848320 hartree
zpe.sumelectthermalfe: -1104.928396 hartree
dipole: -8.5188 3.7048 2.2233
dipole: 9.5519
quadrupole: -105.1058 -138.4442 -154.3147
quadrupole: 16.5117 0.1126 -4.6618
quadrupole: 27.5158 -5.8227 -21.6931 16.5117 0.1126 -4.6618
hfenergy: -1105.2532663 hartree
pointgroup: C01 [X(C19H22N4O2)]
dipole: -3.5146305 -0.0046913 1.3303602 debye
polarizability: 319.3667918|-2.9540627|356.1451099|-41.2396219|60.3572513|147.2482655 unknown
InChI: InChI=1S/C19H22N4O2/c1-23(2)9-8-21-19(24)15-11-12(25-3)10-14-17(20)13-6-4-5-7-16(13)22-18(14)15/h4-7,10-11,21H,8-9,20H2,1-3H3
charge 0 multiplicity 1
47 atoms
O  -0.70672 -4.89337 -1.210878
O  2.977159 -1.68006 -1.474814
N  -0.350852 0.594944 -0.018207
N  2.194464 0.407749 -0.783053
N  5.75595 1.531759 -0.028907
N  -4.111316 -1.306504 0.585602
C  -1.761874 -1.442776 -0.10416
C  -0.499206 -0.74232 -0.291597
C  0.645418 -1.499033 -0.789231
C  -2.888192 -0.692864 0.387296
C  -2.730014 0.708482 0.672292
C  -1.426235 1.304524 0.448387
C  -1.857568 -2.843273 -0.407148
C  3.480495 1.081441 -0.99326
C  4.487065 0.791448 0.151638
C  0.502985 -2.85377 -1.068468
C  2.036837 -0.929277 -1.041433
C  -0.739643 -3.532598 -0.881862
C  -3.791452 1.542028 1.164664
C  -1.2451 2.703338 0.725876
C  -3.584993 2.896021 1.424935
C  -2.295701 3.482958 1.202314
C  6.913177 0.858931 0.593183
C  5.66442 2.949385 0.368566
C  -1.941466 -5.661589 -1.047886
H  3.933587 0.730921 -1.937153
H  3.288388 2.166173 -1.079757
H  -2.800011 -3.381938 -0.269739
H  4.001409 1.017552 1.13553
H  4.700749 -0.291498 0.12973
H  1.375723 -3.400635 -1.440004
H  1.335366 0.890696 -0.424159
H  -4.791814 1.129528 1.346805
H  -0.25175 3.127204 0.547498
H  -4.248212 -2.292263 0.389795
H  -4.908587 -0.782551 0.931621
H  -4.406722 3.515297 1.799822
H  -2.142347 4.547678 1.409075
H  6.994168 -0.171843 0.206483
H  6.854326 0.807412 1.711079
H  7.842152 1.397261 0.328717
H  5.479592 3.086461 1.46625
H  4.846567 3.451041 -0.177523
H  6.605355 3.469575 0.112979
H  -2.748395 -5.26719 -1.696986
H  -2.277257 -5.663355 0.008225
H  -1.686425 -6.6856 -1.356235
