program: Gaussian 09
title: 000150512
version: EM64L-G09RevD.01
frameworkgroup: C1[X(C6H12N2O2)]
method: RPBEPBE
basis: SDD
operation: Freq
keyword: #p
keyword: freq=noraman
keyword: PBEPBE/SDD
title: #p freq=noraman PBEPBE/SDD
converged: YES YES NO NO
title: Mulliken charges:
elementType: O O N N C C C C C C H H H H H H H H H H H H
charge: -0.199856 -0.290551 -0.077859 0.046368 -0.357225 -0.321884 -0.338654 -0.455416 -0.671358 -0.071924 0.250954 0.209073 0.241867 0.244449 0.198203 0.234688 0.262410 0.258412 0.220131 0.208610 0.225988 0.183575
chargesum: 0.00000
title: Mulliken charges with hydrogens summed into heavy atoms:
elementType: O O N N C C C C C C
charge: -0.199856 -0.290551 -0.077859 0.046368 0.102801 0.164432 0.094238 0.065406 -0.016630 0.111650
polarizability: 1.01129510e+02 4.09167035e+00 9.56595267e+01 9.26349160e-01 -5.90107374e+00 6.13217326e+01
1716.lowfreq: -8.1721 -5.1956 -0.0006 -0.0005 -0.0003 8.8258 35.0512 40.5471 56.9028
frequency: 34.9935 40.2633 56.8544 79.2944 134.2271 142.8922 192.4700 214.6704 228.5944 261.8097 300.7038 342.8267 409.1920 515.2811 602.6305 674.9217 706.6659 752.9449 829.6364 858.6991 869.5822 902.2194 915.3594 1044.0127 1050.3523 1072.4949 1073.4482 1105.1883 1147.1652 1180.4880 1213.1453 1264.4464 1269.4363 1289.9450 1300.6555 1334.1970 1336.8215 1353.4767 1371.9188 1389.6366 1392.6288 1428.2936 1443.5216 1473.1306 1478.8053 1480.4893 1484.4083 1640.6577 2881.5167 2978.6480 2981.2499 2988.5412 2996.3111 3001.8408 3020.8412 3043.0290 3044.1976 3066.6160 3082.4420 3083.4607
redmass: 3.5202 3.2761 3.8029 1.7470 3.9268 3.9007 1.8177 3.9230 1.3166 3.7012 4.4190 2.7410 5.1050 5.5081 6.6701 1.1653 2.1922 1.4279 3.1457 1.2394 1.4009 2.2703 2.7007 2.5553 2.8960 2.3254 2.0592 2.1792 2.4828 1.2261 2.1176 1.1639 1.4189 1.4099 1.3924 5.3132 1.6931 1.3528 1.2030 1.4320 1.2115 1.1381 1.1130 1.0592 1.0462 1.0744 1.0720 7.4637 1.0856 1.0358 1.0596 1.0619 1.0622 1.0584 1.0997 1.0982 1.0998 1.1032 1.1002 1.1024
irintensity: 0.1743 11.9397 3.6676 0.9578 8.2730 11.8811 1.9621 0.1095 0.1156 1.1559 0.8713 8.7510 2.4079 3.8924 15.9582 10.1226 10.1313 3.4535 22.9367 0.0569 3.4842 14.5162 8.4921 79.3219 3.3611 3.2185 1.6029 4.8103 38.4522 5.7122 3.9541 4.3241 21.6137 41.6296 1.8613 103.5577 22.2146 3.7575 7.6289 13.7312 10.1832 22.2291 15.3828 2.6812 19.5475 6.1994 16.5161 113.5235 140.3328 32.0045 11.8928 15.7718 13.4844 42.5284 5.4086 0.4167 17.5721 2.2175 48.2358 47.8690
temp: 298.150 k
press: 1.00000 atm
elementType: 8 8 7 7 6 6 6 6 6 6 1 1 1 1 1 1 1 1 1 1 1 1
symmnumber: 1
zpe: 471652.8 jmol-1
zpe.correction: 0.179643 hartree
zpe.thermalcorrener: 0.191637 hartree
zpe.thermalcorrenthalpy: 0.192581 hartree
zpe.thermalcorrgfe: 0.139752 hartree
zpe.sumelectzpe: -494.898935 hartree
zpe.sumelectthermal: -494.886941 hartree
zpe.sumelectthermalent: -494.885997 hartree
zpe.sumelectthermalfe: -494.938826 hartree
dipole: -0.0575 -1.6435 0.0782
dipole: 1.6463
quadrupole: -61.6638 -74.1058 -57.9566
quadrupole: -15.3953 2.7208 1.0701
quadrupole: 2.9116 -9.5304 6.6188 -15.3953 2.7208 1.0701
hfenergy: -495.078578 hartree
pointgroup: C01 [X(C6H12N2O2)]
dipole: 0.0598835 0.6145828 0.1955627 debye
dipolederiv: -0.6014476 -0.0920545 -0.0076177 -0.2235202 -0.6586784 -0.1906603 -0.0821423 -0.2084744 -0.4106561 -0.7102671 -0.7412273 -0.3074267 -0.0974909 -0.6197207 -0.1775286 -0.0078342 -0.1128353 -0.2797385 -0.2488216 0.0473593 -0.0164031 -0.2347848 -0.6976779 -0.18945 -0.2083138 -0.2398722 -0.3421174 0.2113439 0.6799748 0.2794556 0.3996026 0.9389857 0.474981 0.2280373 0.4633253 0.1508238 0.175088 -0.091401 -0.0284476 -0.1058016 0.1132233 -0.0299065 -0.0170545 0.0519517 0.2545221 0.4341229 0.1720325 0.1074416 0.1227536 0.1399165 -0.0806474 0.0694856 -0.1117845 0.2358114 0.0913102 0.0335765 0.0428967 0.0440546 0.1158396 -0.0082242 0.0458297 -0.0772649 0.0001944 -0.3591621 -0.1831712 -0.0322639 -0.249742 -0.1249513 -0.1213694 -0.0590052 -0.122311 0.0626166 -0.0068458 0.0651086 0.031599 0.0727513 0.028174 -0.0013185 -0.015372 0.056322 0.0790151 1.0390009 0.2098235 -0.0393956 0.2246399 0.7321575 0.3756606 -0.04536 0.3680938 0.3113636 -0.0181576 -0.017884 0.0628564 -0.0735404 0.0128708 0.0826735 -0.0010931 0.0041191 0.0718711 0.0433871 0.0208793 -0.0771771 0.0043962 0.024986 -0.1005522 -0.0602885 -0.075284 -0.0699648 0.030609 -0.0048294 -0.0427331 0.0053991 -0.0913521 0.043315 0.0009373 0.0719185 0.0539651 0.0073484 -0.0517204 -0.0129287 -0.0107349 0.067869 -0.0125977 -0.0378397 -0.030077 -0.1126842 -0.0838995 -0.0996708 0.0662728 -0.0868472 -0.0435099 0.0752834 0.0379926 0.0527028 0.044245 0.0520006 0.0121241 -0.0310402 -0.0148642 0.0143145 -0.107911 -0.0239702 -0.0574306 -0.0663057 0.0690328 0.0124522 -0.0181975 0.0868346 -0.0113156 0.045024 0.0352952 0.0736931 0.098429 0.072263 -0.0291422 -0.0156658 0.0562789 0.1282306 -0.0050396 0.0254363 -0.0074657 -0.0550612 -0.0219169 -0.0779203 0.0573997 -0.1398189 -0.0391494 0.0555987 0.0725329 0.0270683 0.0650942 0.0510729 -0.0478203 -0.0678932 -0.0117258 0.0204496 -0.1118431 -0.0085382 -0.1359089 -0.0896017 -0.0022137 0.1074528 -0.0532932 0.1132532 -0.0173356 0.0869419 -0.0841022 0.1038382 -0.015476 -0.2238478 0.0760577 0.1025618 0.118907 -0.0333262 -0.1024295 0.1353671 -0.0943244 0.0136542 unknown
polarizability: 101.5936506|3.6170479|90.0053468|0.7547984|13.5972282|66.5117717 unknown
InChI: InChI=1S/C6H12N2O2/c1-2-4-8(7-10)5-3-6-9/h6H,2-5H2,1H3
charge 0 multiplicity 1
22 atoms
O  3.567616 1.354463 0.324276
O  -1.588698 -2.040609 -0.791054
N  -0.382285 -0.333773 0.036752
N  -0.410885 -1.531489 -0.653591
C  -1.609671 0.296993 0.572271
C  0.928866 0.321335 0.213349
C  -2.308715 1.226661 -0.450425
C  2.07657 -0.427089 -0.481947
C  -3.574902 1.868299 0.15515
C  3.406148 0.279877 -0.304317
H  -2.298805 -0.52103 0.853342
H  -1.331335 0.861287 1.48157
H  0.8704 1.355702 -0.177575
H  1.145973 0.411914 1.295869
H  -1.605095 2.017397 -0.777334
H  -2.574567 0.632714 -1.344005
H  2.173685 -1.464552 -0.105567
H  1.884298 -0.547621 -1.566946
H  -4.302221 1.094662 0.46336
H  -3.331795 2.480279 1.044206
H  -4.073633 2.524929 -0.579655
H  4.274454 -0.235249 -0.789231
