program: Gaussian 09
title: 000150511
version: EM64L-G09RevD.01
frameworkgroup: C1[X(C17H17NO)]
method: RPBEPBE
basis: SDD
operation: Freq
keyword: #p
keyword: freq=noraman
keyword: PBEPBE/SDD
title: #p freq=noraman PBEPBE/SDD
converged: YES YES NO NO
title: Mulliken charges:
elementType: O N C C C C C C C C C C C C C C C C C H H H H H H H H H H H H H H H H H
charge: -0.269734 -0.217737 0.299253 -0.703163 0.191337 0.273781 0.184000 -0.607682 0.464537 -0.417051 -0.347653 -0.424567 -0.396259 -0.396984 -0.238879 -0.235420 0.205806 -0.665946 -0.805323 0.241704 0.244021 0.247054 0.239105 0.295381 0.239192 0.239703 0.244564 0.241993 0.224134 0.224729 0.242287 0.222792 0.220093 0.235262 0.235415 0.270256
chargesum: 0.00000
title: Mulliken charges with hydrogens summed into heavy atoms:
elementType: O N C C C C C C C C C C C C C C C C C
charge: -0.269734 -0.217737 0.299253 -0.217438 0.191337 0.273781 0.184000 -0.360628 0.464537 -0.177946 -0.052272 -0.185375 -0.156555 0.089573 -0.014745 -0.010691 0.205806 0.019226 -0.064391
polarizability: 3.43002592e+02 4.25782315e+00 1.94488639e+02 -2.54420155e+00 6.74361048e-01 9.52526124e+01
1716.lowfreq: -0.0005 0.0001 0.0002 1.4981 3.4510 9.0250 19.4278 45.5388 74.3016
frequency: 19.2967 45.5309 74.2995 110.1927 123.5117 143.5661 160.5290 176.7858 181.9525 209.8110 234.0162 245.5863 262.2415 332.0796 351.2259 414.1832 419.5794 434.4256 446.5775 463.8339 502.4051 508.4780 541.6792 559.4744 566.2177 598.9981 607.4933 642.5364 669.8394 707.9389 740.5528 741.7131 776.6943 778.3813 809.3341 831.9357 837.6001 860.3785 872.5452 928.2629 933.8026 947.0744 961.3455 967.7808 984.5299 991.8326 1001.3459 1025.3065 1026.6697 1076.6843 1094.1948 1106.2367 1124.2258 1131.9151 1140.7896 1168.0315 1175.6893 1190.0320 1203.1823 1230.5166 1252.9759 1264.3721 1304.6332 1307.2628 1343.4884 1351.8924 1374.8413 1377.7273 1390.3234 1395.4496 1428.0071 1444.3436 1448.0746 1450.3470 1462.4443 1465.5647 1475.0585 1488.5721 1495.1247 1508.7825 1580.6291 1590.8866 1594.9873 1621.1677 1628.2859 2979.7959 2989.0197 2989.6983 3023.7611 3032.4953 3074.5472 3077.8169 3086.0281 3101.5482 3119.6073 3127.3695 3129.3629 3136.6988 3141.4524 3157.3132 3160.0367 3214.4161
redmass: 4.4771 4.5361 3.6862 4.3451 4.4173 3.8012 2.5351 1.0387 1.1787 3.6704 2.5576 4.1704 4.2959 4.1537 4.1831 3.0324 2.6317 2.9844 3.7530 3.9865 4.0634 3.4363 5.0080 3.6291 4.2157 3.5502 3.1657 5.8652 5.4331 2.9930 1.9567 3.3172 2.0484 1.7220 2.5253 2.6077 1.7421 1.4615 1.3573 2.6944 1.6134 2.4799 1.5258 1.6865 1.3280 2.9033 2.2576 2.1250 1.6674 2.3095 2.1469 2.2869 2.1500 1.1469 1.9740 1.1596 1.4528 1.8628 1.7226 2.6723 1.7435 2.2935 1.4442 1.9210 1.7828 1.6786 4.7248 1.2319 2.7111 1.4021 1.1528 3.0063 1.1209 2.8117 1.9697 1.2525 1.0548 1.2915 2.0667 1.0957 6.7476 6.7581 7.7935 7.3096 7.2862 1.0607 1.0389 1.0365 1.0995 1.0626 1.0992 1.0971 1.0995 1.1013 1.0856 1.0892 1.0983 1.0913 1.0945 1.0903 1.1002 1.0932
irintensity: 2.3722 1.0104 2.4060 0.7502 0.3072 0.9270 0.2282 0.1750 0.7825 2.6574 6.2734 9.9852 0.4854 0.1779 3.0085 7.1437 3.0890 2.0354 1.6244 7.0116 0.1988 0.7615 0.0098 7.0210 0.1606 8.5349 0.4071 1.7381 3.3097 0.0163 42.2704 16.9552 49.8611 20.5845 1.6697 6.8502 22.4701 10.0778 5.3011 0.6719 1.5920 3.5925 4.6620 8.4104 0.0941 32.6419 25.1806 10.8286 6.7942 6.5785 13.6340 6.4820 49.2198 0.0594 12.8769 0.6744 11.6477 6.5754 6.0803 5.9591 196.4147 29.4367 3.6481 8.0837 114.4715 177.2523 13.1717 42.0416 3.3195 33.0143 16.3250 7.0314 38.7200 113.2762 15.4140 10.2451 11.5022 27.3905 37.3175 14.0401 60.9484 16.4032 161.6773 4.0451 31.7560 16.0141 10.5840 27.0647 8.6687 24.8419 6.1905 13.7697 34.2652 54.9548 4.7820 5.7105 7.5255 6.9850 36.2152 17.5500 39.7626 1.3892
temp: 298.150 k
press: 1.00000 atm
elementType: 8 7 6 6 6 6 6 6 6 6 6 6 6 6 6 6 6 6 6 1 1 1 1 1 1 1 1 1 1 1 1 1 1 1 1 1
symmnumber: 1
zpe: 771585.8 jmol-1
zpe.correction: 0.293882 hartree
zpe.thermalcorrener: 0.310454 hartree
zpe.thermalcorrenthalpy: 0.311399 hartree
zpe.thermalcorrgfe: 0.249270 hartree
zpe.sumelectzpe: -786.664313 hartree
zpe.sumelectthermal: -786.647741 hartree
zpe.sumelectthermalent: -786.646796 hartree
zpe.sumelectthermalfe: -786.708925 hartree
dipole: -1.1717 4.2965 1.5222
dipole: 4.7064
quadrupole: -94.6485 -105.9495 -117.5302
quadrupole: -12.4679 -6.1875 -3.0325
quadrupole: 11.3943 0.0932 -11.4875 -12.4679 -6.1875 -3.0325
hfenergy: -786.9581949 hartree
pointgroup: C01 [X(C17H17N1O1)]
dipole: 0.4436977 -1.6998185 0.5850561 debye
polarizability: 343.0495693|2.8767938|194.4277727|3.3375133|0.2007507|95.2665015 unknown
InChI: InChI=1S/C17H17NO/c1-3-18(12(2)19)15-8-9-17-14(11-15)10-13-6-4-5-7-16(13)17/h4-9,11H,3,10H2,1-2H3
charge 0 multiplicity 1
36 atoms
O  3.760483 2.004427 -0.585627
N  3.104843 -0.105493 0.240036
C  -0.599213 -0.761791 0.037095
C  -1.728246 -1.783843 -0.059402
C  -1.138545 0.555857 0.091572
C  -2.978745 -0.908945 -0.050876
C  -2.608809 0.469262 0.037422
C  0.785275 -0.981002 0.066335
C  1.678888 0.129162 0.156009
C  -0.260531 1.657173 0.179549
C  1.132821 1.44746 0.210784
C  -4.331777 -1.282497 -0.115961
C  -3.599858 1.476144 0.059401
C  3.561135 -1.460022 0.664996
C  -5.326267 -0.271059 -0.092242
C  -4.960696 1.095631 -0.005683
C  4.066214 0.869211 -0.111681
C  3.81505 -2.437819 -0.505111
C  5.540203 0.525896 0.128488
H  -1.717982 -2.495655 0.789593
H  -1.659039 -2.391647 -0.983294
H  1.16066 -2.006194 0.006736
H  -0.644918 2.682193 0.22604
H  1.807595 2.300932 0.257427
H  -4.621719 -2.337661 -0.184659
H  -3.324821 2.534919 0.124924
H  4.482747 -1.350859 1.259399
H  2.801814 -1.870921 1.351759
H  -6.385637 -0.547006 -0.14206
H  -5.741825 1.86415 0.010402
H  2.914427 -2.571739 -1.127547
H  4.6210 -2.073812 -1.16627
H  4.116874 -3.426754 -0.113271
H  5.861404 -0.405106 -0.369509
H  5.763199 0.431798 1.208016
H  6.127695 1.363613 -0.27469
