program: Gaussian 09
title: 000150507
version: EM64L-G09RevD.01
frameworkgroup: C1[X(C19H23N3)]
method: RPBEPBE
basis: SDD
operation: Freq
keyword: #pfreq=noraman
keyword: PBEPBE/SDD
title: #p freq=noraman PBEPBE/SDD
converged: YES YES NO NO
title: Mulliken charges:
elementType: N N N C C C C C C C C C C C C C C C C C C C H H H H H H H H H H H H H H H H H H H H H H H
charge: -0.107755 -0.164190 -0.071031 -0.246357 -0.164539 -0.504242 -0.026402 -0.593800 0.501995 -0.407482 -0.210738 0.342778 0.273885 -0.732563 -0.445011 -0.499478 -0.385190 -0.215627 -0.375429 -0.167006 -0.357396 -0.677333 0.246236 0.270435 0.231479 0.227645 0.207106 0.242575 0.223256 0.224235 0.226902 0.216817 0.216636 0.234620 0.263698 0.235279 0.233504 0.215219 0.215078 0.212783 0.223715 0.218193 0.210067 0.226988 0.210445
chargesum: 0.00000
title: Mulliken charges with hydrogens summed into heavy atoms:
elementType: N N N C C C C C C C C C C C C C C C C C C C
charge: -0.107755 -0.164190 -0.071031 -0.000121 0.105895 -0.045118 0.180704 -0.127970 0.501995 0.043655 -0.210738 0.342778 0.273885 -0.064490 -0.181313 -0.264198 -0.151686 -0.000408 0.052432 -0.167006 0.084512 -0.029833
polarizability: 2.80974180e+02 4.44518241e+00 2.31563720e+02 8.70002800e+00 -1.06761449e+01 1.50667640e+02
1716.lowfreq: -8.9266 -6.0726 -0.0006 -0.0005 -0.0002 8.9898 25.1936 35.0221 45.2599
frequency: 24.8213 34.9161 45.1642 71.0219 72.1531 79.6876 118.1589 151.7263 156.8074 188.2737 206.5856 224.3610 227.0927 245.2037 255.3320 274.4332 277.9573 295.4489 333.6393 347.3137 374.6051 382.4119 413.0702 420.2813 487.4967 521.3088 529.2803 541.2912 566.8404 572.9052 598.1312 611.3050 619.1024 653.9971 676.4855 726.3789 748.3825 753.4155 777.2881 787.3633 789.9310 803.5859 813.3130 833.8395 871.2671 880.7612 885.7361 901.1371 924.4477 947.6748 952.9975 958.9232 985.3982 1003.0523 1027.5564 1039.5805 1049.1903 1070.5176 1079.7772 1096.9353 1101.1426 1108.2627 1119.6832 1143.2476 1163.2458 1171.6787 1176.7004 1188.6610 1197.8973 1221.4982 1228.3712 1231.3403 1264.2370 1270.0887 1274.1893 1287.5062 1299.0711 1308.9008 1316.2377 1325.8579 1332.8166 1339.7942 1344.7845 1353.4345 1354.0482 1370.0555 1378.7215 1387.7302 1391.4425 1394.9487 1418.3615 1455.8182 1458.9444 1466.2647 1469.7226 1474.1234 1478.2289 1481.1085 1482.0065 1490.0767 1491.8288 1494.4901 1562.5879 1611.3814 1624.9998 2171.0687 2947.9454 2970.0917 2973.2244 2976.2793 2980.0415 2987.2634 2990.5121 2996.8781 2997.1782 3022.3052 3032.2253 3038.5466 3043.3784 3054.9985 3061.7633 3072.0255 3076.3511 3081.9302 3084.0472 3117.9528 3133.6069 3154.8518 3209.6119
redmass: 3.2947 4.6838 5.1982 4.2800 1.7814 4.6164 2.8514 5.8687 2.6722 2.9115 3.8332 1.2328 1.2627 2.2915 2.6371 3.4276 3.6388 4.4098 3.8565 2.9645 1.9104 4.5796 3.3182 4.7494 10.3479 3.8608 3.8465 4.6935 5.1015 3.9339 4.0037 3.5749 4.9807 2.9588 4.3883 3.3775 1.1765 1.4710 2.8471 4.0297 1.6600 3.1915 2.7835 2.8509 1.2573 1.4240 1.8278 1.7054 1.9351 2.2103 1.4155 2.0392 2.4647 2.2164 2.0403 2.0604 2.9249 2.2397 2.5070 2.6835 2.0034 2.1608 1.6576 2.6629 1.8588 1.5246 1.3180 1.7129 1.6200 1.5290 1.8091 1.3890 1.6192 1.3857 1.4155 1.3747 1.3266 1.5898 1.4356 1.4435 1.8300 1.6223 1.3488 1.3219 1.5123 2.2061 1.7984 2.3370 1.2966 1.2103 5.9554 1.6941 1.3050 1.0742 1.0695 1.2704 1.1485 1.0483 1.0856 1.1430 1.0586 3.1696 6.7801 7.8766 8.5465 12.4911 1.0684 1.0640 1.0694 1.0362 1.0395 1.0601 1.0748 1.0807 1.0600 1.0874 1.1005 1.0967 1.0996 1.1030 1.0954 1.0991 1.1029 1.0989 1.0988 1.0866 1.0907 1.0982 1.0978
irintensity: 0.2405 3.1206 0.7937 0.9222 0.0827 1.4700 0.2380 6.0945 0.5945 1.6749 3.2477 0.0075 0.0386 1.2897 2.3183 0.2819 0.0760 0.6808 0.6348 1.3785 0.0649 2.5906 3.3919 1.6957 5.8518 0.9496 0.4521 0.0623 5.5524 6.4875 1.4077 1.9248 2.8579 1.5658 0.9868 14.0402 7.3706 57.7579 31.5248 8.3347 9.7852 4.0076 6.5455 12.0686 2.9041 0.4480 7.6097 5.5041 4.8066 4.4714 1.5474 3.0937 4.9405 2.2003 10.0589 13.2587 0.3937 9.6179 3.1587 17.0343 26.7263 4.9072 19.4807 28.3378 23.1510 6.3811 2.5472 15.1227 12.5190 20.3941 0.4170 1.6864 7.1479 11.8915 10.8541 2.5948 2.9388 5.2033 0.8781 15.4950 39.0643 6.0518 2.8676 1.9615 26.3556 5.8982 29.3637 17.2522 12.6619 15.9841 17.7799 28.3789 22.3496 15.4332 4.8987 17.8643 22.5027 12.5812 12.6389 24.5076 7.4214 4.2415 6.8086 4.9553 14.8383 273.7507 30.4882 51.4249 3.5784 37.1639 31.1618 15.1432 54.7821 37.3456 59.3464 7.9905 1.1518 32.9276 18.9350 0.6762 17.3325 43.7188 70.8619 37.4222 39.6951 6.0207 19.3827 32.4024 0.7512
temp: 298.150 k
press: 1.00000 atm
elementType: 7 7 7 6 6 6 6 6 6 6 6 6 6 6 6 6 6 6 6 6 6 6 1 1 1 1 1 1 1 1 1 1 1 1 1 1 1 1 1 1 1 1 1 1 1
symmnumber: 1
zpe: 998802.1 jmol-1
zpe.correction: 0.380424 hartree
zpe.thermalcorrener: 0.400471 hartree
zpe.thermalcorrenthalpy: 0.401415 hartree
zpe.thermalcorrgfe: 0.331300 hartree
zpe.sumelectzpe: -900.459216 hartree
zpe.sumelectthermal: -900.439168 hartree
zpe.sumelectthermalent: -900.438224 hartree
zpe.sumelectthermalfe: -900.508340 hartree
dipole: 4.1361 2.9903 3.3809
dipole: 6.1221
quadrupole: -120.5640 -141.9000 -135.9968
quadrupole: -22.0254 -11.6425 -12.1933
quadrupole: 12.2562 -9.0797 -3.1765 -22.0254 -11.6425 -12.1933
hfenergy: -900.8396393 hartree
pointgroup: C01 [X(C19H23N3)]
dipole: -1.6992363 1.1372286 -1.2730828 debye
polarizability: 281.4951197|-2.1792365|230.5727621|6.1637723|13.3504568|151.1376589 unknown
InChI: InChI=1S/C19H23N3/c1-3-7-21-11-14-9-18-16(8-13(2)10-22(18)12-20)15-5-4-6-17(21)19(14)15/h4-6,11,13,16,18H,3,7-10H2,1-2H3
charge 0 multiplicity 1
45 atoms
N  3.121526 -1.003057 0.154337
N  -2.892155 -0.519504 -0.636461
N  4.059235 -3.033594 1.377413
C  1.533973 0.908342 0.295858
C  1.675683 -0.654523 0.312322
C  2.248846 1.517421 -0.946402
C  3.746813 1.113413 -1.020088
C  0.793075 -1.415898 -0.739051
C  0.066777 1.318703 0.361895
C  3.859787 -0.43029 -1.006406
C  -0.877634 0.380444 -0.106797
C  -0.633502 -0.938224 -0.624053
C  -2.28274 0.631505 -0.111843
C  4.598598 1.757975 0.097958
C  -1.884075 -1.469985 -0.932622
C  -0.434926 2.547409 0.834102
C  -2.787623 1.868369 0.356091
C  -1.841287 2.810253 0.822327
C  -4.340077 -0.748121 -0.748325
C  3.609556 -2.085579 0.785887
C  -4.990077 -1.236836 0.569516
C  -6.511326 -1.442829 0.413653
H  2.054015 1.281709 1.199684
H  1.369079 -1.005424 1.315532
H  1.724086 1.188104 -1.865683
H  2.156821 2.619202 -0.910296
H  4.142775 1.454189 -1.99908
H  0.892434 -2.502442 -0.558996
H  1.18606 -1.224913 -1.758364
H  3.459424 -0.846843 -1.955242
H  4.914229 -0.745563 -0.921566
H  5.675524 1.573256 -0.071099
H  4.443904 2.852242 0.129797
H  4.343719 1.345959 1.090535
H  -2.15676 -2.440338 -1.345789
H  0.24782 3.31231 1.223775
H  -3.857782 2.101074 0.371834
H  -2.199731 3.775878 1.197338
H  -4.821056 0.194182 -1.074706
H  -4.513983 -1.491497 -1.548927
H  -4.785546 -0.499259 1.368746
H  -4.505973 -2.182382 0.880123
H  -7.016256 -0.501735 0.124055
H  -6.963115 -1.787948 1.360419
H  -6.737933 -2.198855 -0.361799
