program: Gaussian 09
title: 000150506
version: EM64L-G09RevD.01
frameworkgroup: C1[X(C14H11Cl2NO3)]
method: RPBEPBE
basis: SDD
operation: Freq
keyword: #p
keyword: freq=noraman
keyword: PBEPBE/SDD
title: #p freq=noraman PBEPBE/SDD
converged: YES YES NO NO
title: Mulliken charges:
elementType: Cl Cl O O O N C C C C C C C C C C C C C C H H H H H H H H H H H
charge: -0.013223 -0.046507 -0.280466 -0.374532 -0.256729 -0.192500 0.426256 0.344379 -0.328818 -0.392206 -0.352410 -0.368137 0.473219 -0.308688 -0.319317 0.210952 -0.194958 -0.209135 -0.110890 -0.751559 0.306264 0.274893 0.268886 0.262398 0.279617 0.281786 0.260768 0.261330 0.228678 0.252154 0.368495
chargesum: 0.00000
title: Mulliken charges with hydrogens summed into heavy atoms:
elementType: Cl Cl O O O N C C C C C C C C C C C C C C
charge: -0.013223 -0.046507 -0.280466 -0.006037 -0.256729 -0.192500 0.426256 0.344379 -0.022554 -0.117314 -0.083523 -0.105738 0.473219 -0.308688 -0.039699 0.210952 0.086828 0.051633 -0.110890 -0.009398
polarizability: 3.12964485e+02 -7.10902885e+00 1.89436922e+02 -9.74597949e+00 7.17780312e+00 1.08697763e+02
1716.lowfreq: -8.4123 -3.4961 0.0007 0.0012 0.0014 4.1513 16.8028 23.6660 30.9089
frequency: 16.7092 23.6332 30.8626 54.7403 68.0497 101.0178 125.3155 139.4485 146.1977 164.6512 174.1868 197.7956 211.0063 271.9115 302.2801 309.0105 325.5954 343.2525 371.3080 378.1282 397.5352 414.6810 431.1923 440.6704 470.2881 511.4069 540.1201 556.1981 563.3831 571.9217 618.7274 644.0384 648.4546 689.5985 700.8434 722.4766 774.6405 810.2530 830.1275 845.1194 860.7456 862.3990 897.0120 942.3332 957.1814 971.7607 993.1273 1006.8629 1011.3428 1028.9207 1030.7510 1081.3970 1120.1542 1143.4778 1160.7407 1186.0445 1206.5016 1233.6370 1248.0201 1293.5331 1304.7665 1338.3131 1356.4132 1377.8586 1382.2194 1385.6508 1421.5116 1445.6321 1455.1988 1456.5404 1482.4716 1570.5060 1583.0916 1591.7998 1601.3503 1615.8721 3002.7313 3091.9876 3138.0555 3156.2157 3160.3276 3165.7244 3180.3249 3183.3294 3189.0873 3206.0184 3437.2916
redmass: 7.0588 8.3844 7.7321 4.5561 4.6686 6.5315 5.1738 1.1040 11.6659 5.8902 6.5485 8.5647 9.2429 7.5513 1.6255 2.7825 4.3740 6.3924 8.1924 5.9240 7.1986 3.0662 5.1973 3.7671 6.1782 3.0083 4.6808 3.2198 4.3099 6.7986 6.8403 7.3185 5.8187 5.2698 5.1289 4.6987 6.8592 1.4124 1.2456 1.7036 4.9160 1.4112 5.0828 1.3346 1.3188 1.3246 2.6978 1.9866 4.7238 4.1448 1.6987 2.4743 1.2894 1.3490 1.8524 1.6399 2.6865 3.2001 1.5023 1.5272 1.7964 2.0963 4.6098 4.4218 1.3336 5.4890 3.7504 1.0878 2.5634 1.0619 2.5282 8.0310 7.6851 7.7694 7.8190 6.6906 1.0378 1.0958 1.1012 1.0911 1.0888 1.0894 1.0961 1.0941 1.0955 1.0947 1.0683
irintensity: 2.6159 1.7907 0.3022 2.2266 1.7198 1.3048 0.6812 4.9153 1.5498 0.6142 2.8115 4.6684 9.4085 7.7749 47.3397 62.1477 41.6935 14.7119 0.2917 0.3998 1.5978 0.4638 3.8717 11.1691 4.8233 30.2415 15.8662 2.3654 15.0365 5.2378 9.0493 3.9749 2.7123 13.1017 22.6909 10.9752 32.0301 53.8969 3.4684 79.8485 25.6651 17.8922 15.3276 0.3098 1.7687 1.2890 14.4323 39.1660 21.1676 99.7627 9.0344 65.4957 6.5193 4.0656 50.8311 6.4397 9.0917 472.0095 128.9567 52.7337 89.6662 175.1929 44.4984 15.6429 43.8249 6.7234 2.1441 21.8768 386.2462 29.2195 301.6007 24.8350 15.8400 16.7083 119.5343 6.5072 6.8150 10.7634 7.9644 7.8911 0.6383 3.4768 0.2649 0.7454 1.0048 5.5243 9.6954
temp: 298.150 k
press: 1.00000 atm
elementType: 17 17 8 8 8 7 6 6 6 6 6 6 6 6 6 6 6 6 6 6 1 1 1 1 1 1 1 1 1 1 1
symmnumber: 1
zpe: 570935.8 jmol-1
zpe.correction: 0.217458 hartree
zpe.thermalcorrener: 0.236521 hartree
zpe.thermalcorrenthalpy: 0.237465 hartree
zpe.thermalcorrgfe: 0.167067 hartree
zpe.sumelectzpe: -1739.149081 hartree
zpe.sumelectthermal: -1739.130018 hartree
zpe.sumelectthermalent: -1739.129074 hartree
zpe.sumelectthermalfe: -1739.199472 hartree
dipole: -4.1551 1.7107 0.7070
dipole: 4.5488
quadrupole: -113.0562 -133.2327 -130.9747
quadrupole: -13.9250 -0.6662 -2.1050
quadrupole: 12.6984 -7.4782 -5.2202 -13.9250 -0.6662 -2.1050
hfenergy: -1739.3665391 hartree
pointgroup: C01 [X(C14H11Cl2N1O3)]
dipole: -1.6488869 -0.6843096 -0.1251968 debye
polarizability: 313.3492858|6.5162095|188.6546461|6.6650321|-9.7087036|109.0952379 unknown
InChI: InChI=1S/C14H11Cl2NO3/c1-9(18)17(19)11-3-5-12(6-4-11)20-14-7-2-10(15)8-13(14)16/h2-8,19H,1H3
charge 0 multiplicity 1
31 atoms
Cl 3.765618 -2.534066 1.405067
Cl 6.273816 1.994965 -0.605152
O  1.355763 -1.438705 0.049388
O  -4.982179 -0.949745 -0.502021
O  -4.044821 2.327467 0.649003
N  -4.110427 0.081054 0.041593
C  -2.710791 -0.24026 0.025895
C  0.018781 -0.955293 0.01023
C  -1.755389 0.580112 0.689556
C  -2.282884 -1.420142 -0.639325
C  -0.394419 0.216554 0.681406
C  -0.920279 -1.775611 -0.644993
C  2.446484 -0.565985 -0.083499
C  3.680346 -0.982919 0.475413
C  2.400617 0.644462 -0.817231
C  -4.726882 1.328916 0.277248
C  4.849414 -0.214357 0.320854
C  3.560904 1.430617 -0.9781
C  4.769043 0.989903 -0.405006
C  -6.232533 1.373008 0.074089
H  -2.080501 1.49124 1.191953
H  -3.010795 -2.037878 -1.169542
H  0.332415 0.841018 1.210197
H  -0.576331 -2.681114 -1.152703
H  1.458888 0.966025 -1.271244
H  5.792341 -0.549331 0.759856
H  3.521609 2.363311 -1.546992
H  -6.510322 1.056309 -0.944857
H  -6.756109 0.701391 0.778411
H  -6.561664 2.407303 0.252169
H  -5.142916 -1.583152 0.254337
