program: Gaussian 09
title: 000150502
version: EM64L-G09RevD.01
frameworkgroup: C1[X(C9H10O2)]
method: RPBEPBE
basis: SDD
operation: Freq
keyword: #pfreq=noraman
keyword: PBEPBE/SDD
title: #p freq=noraman PBEPBE/SDD
converged: YES YES NO NO
title: Mulliken charges:
elementType: O O C C C C C C C C C H H H H H H H H H H
charge: -0.299832 -0.429003 -0.255782 -0.069025 0.473172 -0.376779 -0.401296 -0.375717 -0.226086 -0.227428 -0.238100 0.225654 0.239673 0.209442 0.230518 0.233957 0.260516 0.228007 0.227125 0.340970 0.230014
chargesum: 0.00000
title: Mulliken charges with hydrogens summed into heavy atoms:
elementType: O O C C C C C C C C C
charge: -0.299832 -0.088033 -0.030128 0.170648 0.473172 0.063181 -0.167339 -0.115200 0.001921 -0.000303 -0.008086
polarizability: 1.34438594e+02 7.05176026e+00 9.38077009e+01 8.23165058e+00 -1.19485026e+01 6.89721069e+01
1716.lowfreq: -5.5582 -0.0002 0.0002 0.0006 4.0682 10.2461 35.2898 67.6167 87.3186
frequency: 35.1645 67.6166 87.3176 131.6017 208.4774 269.2241 313.5919 346.8896 403.4096 404.0164 437.1307 523.4160 604.8619 614.6492 702.9927 729.9238 766.5164 805.4587 829.3700 854.4186 920.7761 946.8883 950.0125 977.2305 988.8958 996.3602 1025.3137 1037.5503 1068.9828 1074.2227 1099.1871 1172.8500 1176.2465 1185.0700 1201.9609 1242.5549 1301.7571 1319.4635 1335.2185 1362.6687 1387.3303 1419.3182 1448.1505 1468.5091 1488.3503 1593.1489 1616.7485 2975.0645 3061.9614 3088.3375 3097.3328 3120.1977 3127.9347 3139.6444 3150.6809 3165.4447 3566.5286
redmass: 4.1834 4.9173 3.7585 3.1867 5.0133 1.5388 2.0558 3.4589 2.8543 3.8678 6.8259 3.4065 5.4037 6.4392 1.9754 3.5861 2.3908 2.8817 5.2619 1.2475 1.3934 1.9125 4.4209 1.3998 5.8127 1.3181 2.0968 1.6670 1.4000 1.5019 1.4873 1.0655 1.4776 1.1161 2.1521 1.4588 1.4186 1.2852 1.2790 1.2894 5.5977 2.3784 2.2267 1.0924 2.5340 6.0964 6.0765 1.0681 1.0896 1.0900 1.0960 1.0865 1.0867 1.0915 1.0962 1.1015 1.0666
irintensity: 0.8706 1.3728 3.7952 2.4215 10.9827 108.0449 36.5859 40.5325 0.4037 40.9107 0.4661 19.1316 4.2638 0.0173 39.2300 44.4808 50.6363 1.6214 14.8110 0.0944 5.0659 19.4841 92.4578 0.1107 0.1154 0.1486 3.9251 15.3157 8.1969 7.5221 9.9537 0.0748 11.9742 1.3209 4.3830 2.1978 9.6508 8.3378 6.5534 13.1147 0.1093 3.0849 11.6086 8.4805 11.6144 0.6611 4.6135 65.6251 9.5954 13.6636 32.0796 6.9288 0.4257 14.6374 31.4454 21.7538 8.8423
temp: 298.150 k
press: 1.00000 atm
elementType: 8 8 6 6 6 6 6 6 6 6 6 1 1 1 1 1 1 1 1 1 1
symmnumber: 1
zpe: 439232.5 jmol-1
zpe.correction: 0.167295 hartree
zpe.thermalcorrener: 0.177484 hartree
zpe.thermalcorrenthalpy: 0.178428 hartree
zpe.thermalcorrgfe: 0.130451 hartree
zpe.sumelectzpe: -498.534942 hartree
zpe.sumelectthermal: -498.524753 hartree
zpe.sumelectthermalent: -498.523809 hartree
zpe.sumelectthermalfe: -498.571786 hartree
dipole: 0.6317 0.2926 1.9622
dipole: 2.0820
quadrupole: -60.1679 -67.4209 -62.2078
quadrupole: 4.5171 -2.6896 -6.4503
quadrupole: 3.0977 -4.1554 1.0577 4.5171 -2.6896 -6.4503
hfenergy: -498.7022372 hartree
pointgroup: C01 [X(C9H10O2)]
dipole: -0.2866978 0.1724935 -0.7476818 debye
dipolederiv: -0.6024867 0.0036965 -0.0043809 0.1630015 -0.5923459 0.1765643 -0.1034234 0.1659188 -0.3639713 -0.7587056 -0.0291035 0.1410595 -0.1766638 -0.563809 0.3023889 0.1755008 0.271221 -0.2929439 0.3163338 -0.0031255 0.0475643 -0.1292154 0.2571391 0.0482765 0.2919838 -0.0647504 0.2531465 0.1845817 0.044038 0.0559122 -0.0031598 0.1769926 -0.044225 -0.0846631 0.0218662 0.251178 0.2370077 -0.0504096 -0.0214316 -0.0181624 -0.0623714 -0.014167 -0.0015011 -0.0042952 -0.0711307 0.4468095 -0.0156929 -0.1180239 0.1739422 0.4777978 -0.1940133 -0.0890774 -0.1754145 0.3345872 -0.1348245 0.0750311 0.0689012 0.0635757 0.0025723 0.0903145 0.0132917 0.0961654 -0.0954389 -0.1495453 -0.0496699 0.0092554 -0.0925395 0.0064288 0.052757 0.0147742 0.0223421 -0.1214302 -0.0040459 -0.0876294 -0.000306 -0.1051317 0.059613 0.0730902 -0.0021384 0.0717185 -0.1117017 -0.0039641 0.0577795 0.0644181 0.0794676 0.0420195 0.1027777 0.0689334 0.1025053 -0.0856569 0.0442015 -0.0239549 0.0631405 -0.0249851 -0.0888338 0.0291014 0.0475211 0.0342139 -0.1343209 -0.0149336 0.0059569 -0.0487085 -0.0136292 -0.0098613 -0.1002535 -0.0742685 -0.08246 0.0015341 0.0052218 -0.0456736 -0.0493578 -0.0345994 0.082302 -0.0291133 -0.0342094 -0.0077321 -0.1209196 -0.1300172 0.0855381 0.0663031 0.0830031 -0.1248557 0.0013951 0.0990724 -0.0546052 0.0359639 0.0859736 -0.0128716 -0.0037652 -0.0367713 0.054968 -0.0295033 -0.0582245 0.0044136 -0.1015502 0.0423883 -0.0783053 -0.076497 -0.0620992 0.0072411 -0.0858834 -0.0642991 -0.0916859 0.0868611 0.0864558 0.0845926 0.0145326 0.0731438 0.004061 -0.0580548 0.0194454 -0.0393773 0.1253275 0.0239251 0.0940155 0.0139704 0.1071802 -0.0462019 -0.0739497 0.0157461 -0.0737479 0.1252597 0.0270492 -0.0627691 -0.0616067 -0.0764245 -0.0171018 -0.0992556 -0.0754683 -0.0948355 0.0923474 0.4183525 -0.0199379 -0.1000927 0.0018534 0.2336372 -0.1253999 -0.094693 -0.0788986 0.0579437 -0.1197777 0.0284947 -0.060887 0.0282138 0.1006084 -0.0228468 -0.0643029 -0.0225624 0.1349152 unknown
polarizability: 134.845887|-7.5734246|92.3049317|4.4622697|13.8503242|70.067583 unknown
InChI: InChI=1S/C9H10O2/c10-6-8-9(11-8)7-4-2-1-3-5-7/h1-5,8-10H,6H2
charge 0 multiplicity 1
21 atoms
O  1.52376 -1.45779 0.701529
O  3.581098 1.291276 -0.966329
C  0.923762 -0.056766 0.674624
C  1.946029 -0.461605 -0.35142
C  -0.531185 0.054172 0.356148
C  3.387767 0.01006 -0.266074
C  -1.243125 1.220705 0.734833
C  -1.212902 -0.983003 -0.330683
C  -2.611834 1.358077 0.414427
C  -2.581832 -0.846892 -0.645319
C  -3.284911 0.325591 -0.278892
H  1.287657 0.579707 1.493615
H  1.572288 -0.705463 -1.358665
H  4.071059 -0.771115 -0.660286
H  3.655717 0.211762 0.783289
H  -0.725048 2.022658 1.275332
H  -0.669411 -1.901844 -0.578607
H  -3.152589 2.264288 0.709302
H  -3.104011 -1.655927 -1.168415
H  3.467172 1.153653 -1.940593
H  -4.348159 0.429052 -0.522416
