program: Gaussian 09
title: 000150499
version: EM64L-G09RevD.01
frameworkgroup: C1[X(C9H9N3O)]
method: RPBEPBE
basis: SDD
operation: Freq
keyword: #pfreq=noraman
keyword: PBEPBE/SDD
title: #p freq=noraman PBEPBE/SDD
converged: YES YES NO NO
title: Mulliken charges:
elementType: O N N N C C C C C C C C C H H H H H H H H H
charge: -0.273698 -0.057429 0.058131 -0.011584 -0.519796 0.499476 -0.501379 -0.423325 0.403728 -0.194615 -0.376770 -0.624272 -0.255835 0.224214 0.265111 0.278151 0.240869 0.241035 0.250966 0.274821 0.238456 0.263744
chargesum: 0.00000
title: Mulliken charges with hydrogens summed into heavy atoms:
elementType: O N N N C C C C C C C C C
charge: -0.273698 -0.057429 0.058131 -0.011584 -0.030470 0.499476 -0.223228 -0.182456 0.403728 0.046421 -0.113026 0.139971 -0.255835
polarizability: 1.46265172e+02 -2.21561125e-01 1.45625626e+02 -1.01004115e+01 -2.95247131e+00 6.95923701e+01
1716.lowfreq: -0.0008 0.0003 0.0007 7.8168 8.2775 11.6712 25.7608 41.1190 71.4372
frequency: 25.7156 41.1161 71.4353 104.2373 135.4990 145.2118 209.8641 248.1198 292.2051 349.7741 362.4178 382.4207 387.7079 450.8659 455.6393 554.4756 566.2044 609.6075 692.0579 713.1904 718.1426 808.0109 819.6287 888.1476 929.9142 937.1302 941.0263 979.8115 988.1487 997.2489 1094.7172 1102.2551 1136.5452 1153.2264 1187.0455 1242.0740 1266.1443 1291.7710 1309.0213 1339.4831 1365.5088 1378.9633 1408.1730 1430.6924 1456.1757 1469.0595 1473.4751 1477.9446 1590.0180 1612.0752 2181.2839 2980.6049 2986.3881 3047.8928 3070.9587 3098.2920 3127.3729 3145.5748 3151.9575 3172.8346
redmass: 4.1301 8.1852 3.5271 1.0952 7.4695 5.6723 3.9727 5.7442 5.7942 3.7478 2.3993 4.5106 4.7790 4.6401 5.7412 7.4207 5.3378 5.7506 3.1303 3.4233 3.4319 2.5858 2.2836 2.2073 2.6663 1.7557 1.6737 1.9642 5.2265 1.3734 1.5786 1.4082 1.6535 1.7920 1.0885 3.6236 4.7736 1.5134 1.4512 1.6781 3.0197 6.2465 1.3110 2.3207 1.1374 1.0819 2.2586 1.0594 5.8366 6.0329 12.6327 1.0334 1.0590 1.1009 1.1016 1.0996 1.0893 1.0930 1.0910 1.0992
irintensity: 0.7307 3.3296 1.6910 0.4955 2.5316 0.7124 6.0446 1.8318 4.4415 2.4937 3.1301 0.2673 3.8246 4.7578 3.0016 0.7034 5.8075 2.2493 5.1278 20.3639 20.6098 21.1162 44.9200 58.3587 9.1669 60.5032 49.6501 66.5761 2.8519 1.2801 5.1928 1.3246 9.7760 9.3311 0.1517 7.1331 11.0773 15.6691 47.9202 44.9574 84.6439 0.8715 40.9826 5.3905 19.7370 10.4852 16.4849 18.7279 7.6617 3.7506 20.6801 21.4248 32.1911 7.3258 21.3461 1.8964 6.7278 0.9893 8.2687 10.3980
temp: 298.150 k
press: 1.00000 atm
elementType: 8 7 7 7 6 6 6 6 6 6 6 6 6 1 1 1 1 1 1 1 1 1
symmnumber: 1
zpe: 433960.3 jmol-1
zpe.correction: 0.165287 hartree
zpe.thermalcorrener: 0.177583 hartree
zpe.thermalcorrenthalpy: 0.178527 hartree
zpe.thermalcorrgfe: 0.124937 hartree
zpe.sumelectzpe: -586.823170 hartree
zpe.sumelectthermal: -586.810874 hartree
zpe.sumelectthermalent: -586.809930 hartree
zpe.sumelectthermalfe: -586.863520 hartree
dipole: -0.5369 -7.2953 1.0054
dipole: 7.3838
quadrupole: -90.5681 -82.6417 -75.1186
quadrupole: 2.7197 2.4602 -0.2181
quadrupole: -7.7919 0.1345 7.6575 2.7197 2.4602 -0.2181
hfenergy: -586.9884566 hartree
pointgroup: C01 [X(C9H9N3O1)]
dipole: 0.4220935 2.8734577 0.0640503 debye
dipolederiv: -0.6301817 0.6072837 -0.1083883 0.4537392 -0.8534369 0.2074322 0.3643564 -0.461854 -0.1790442 -0.4597148 0.1555041 -0.0814079 0.4222597 -0.7640017 0.0512617 -0.2605939 0.324439 -0.2669088 0.3142743 -0.6932746 0.1454004 -0.8584028 1.3312065 -0.3666126 0.0488002 -0.0563841 -0.0301534 -0.2982167 -0.068657 -0.0247422 -0.1040604 -0.2956379 -0.0436091 -0.03317 -0.0343242 -0.2523625 0.5613292 -0.1343101 0.0491816 -0.1043059 0.2978252 0.1324309 -0.163033 0.2346291 0.1456783 0.1735784 -0.0766841 0.1013127 -0.0474047 -0.1370033 -0.0726731 0.1665399 -0.1054848 -0.0056937 -0.1302596 0.0645413 0.0215055 -0.0762197 0.0059483 -0.0283479 -0.0116624 0.0364401 -0.1295805 -0.112831 0.0787078 0.0425599 0.0489215 0.0434998 0.0298615 0.0435241 0.0364246 -0.1091994 0.1098275 -0.0580966 -0.0140173 -0.0562507 0.0819983 -0.0296702 -0.0093962 -0.0252132 0.1168585 -0.102998 -0.0629275 0.0160158 -0.0832687 0.1362373 -0.0448349 -0.0003723 -0.0213683 -0.1204094 -0.0258329 -0.0611389 0.0754109 0.0556976 -0.0386646 0.0209574 0.0640773 -0.030417 -0.1109043 0.1653084 0.1580034 0.0193055 0.205806 -0.0549078 0.0635503 0.0278287 -0.0378223 0.1390788 0.1029145 0.1780864 0.0416255 0.2175646 0.163983 0.1009952 0.0503478 0.0871353 0.0435908 -0.0398992 -0.0209582 -0.024628 -0.040414 -0.1335212 -0.0866968 0.0336438 -0.0279658 0.0984594 0.0126007 0.0176621 -0.0094586 -0.0118974 0.0989575 0.1047904 0.0444587 0.0002702 -0.0059987 0.1314291 0.0351922 -0.0289674 0.0482395 -0.0084093 0.014344 -0.023367 0.0149706 0.1331474 0.0301858 -0.1070531 -0.0651891 -0.0820814 0.0056441 -0.0385855 -0.0578455 -0.0505146 0.1170875 0.0742873 0.0541322 -0.0368948 0.0525433 -0.0817238 0.0208953 -0.0452002 0.027529 0.1395614 -0.0036894 -0.0068197 -0.1129484 -0.0093227 0.0840319 0.0526828 -0.1011875 0.0826357 -0.0014808 0.0749699 0.0232061 0.0637868 0.1036187 0.0670467 -0.1014719 0.0077535 0.0017831 0.1173898 0.0583792 -0.1085337 0.0157828 -0.1460324 -0.04569 0.0089385 -0.0568462 -0.0070932 0.0375673 -0.0054609 0.0261342 -0.0852452 0.0112707 0.0966177 0.0043618 -0.0886562 0.0121849 0.1233166 unknown
polarizability: 137.3856052|-2.107798|145.6537841|26.2814851|3.9633329|78.4437779 unknown
InChI: InChI=1S/C9H9N3O/c1-12(11-13)7-9-4-2-3-8(5-9)6-10/h2-5H,7H2,1H3
charge 0 multiplicity 1
22 atoms
O  3.577636 -2.342807 0.668805
N  2.554007 -0.324331 0.668595
N  2.798737 -1.546551 1.302374
N  -3.234486 -1.999002 -1.128627
C  1.665145 0.5790 1.414968
C  0.336946 0.846032 0.710166
C  -0.474378 -0.233525 0.28909
C  -0.111221 2.171897 0.495298
C  -1.722114 0.012681 -0.341623
C  -1.355559 2.421451 -0.12878
C  -2.165105 1.349128 -0.550522
C  3.134333 0.044271 -0.631086
C  -2.546608 -1.088561 -0.770643
H  2.184154 1.538658 1.60482
H  1.497619 0.08451 2.390364
H  -0.141023 -1.265148 0.448313
H  0.513898 3.013627 0.817116
H  -1.691064 3.451232 -0.288149
H  2.337984 0.269677 -1.362403
H  3.728063 -0.817286 -0.98096
H  3.791477 0.927377 -0.527745
H  -3.128539 1.530371 -1.036772
