program: Gaussian 09
title: 000150474
version: EM64L-G09RevD.01
frameworkgroup: C1[X(C22H21N3O5S2)]
method: RPBEPBE
basis: SDD
operation: Freq
keyword: #p
keyword: freq=noraman
keyword: PBEPBE/SDD
title: #p freq=noraman PBEPBE/SDD
converged: YES YES NO NO
title: Mulliken charges:
elementType: S S O O O O O N N N C C C C C C C C C C C C C C C C C C C C C C H H H H H H H H H H H H H H H H H H H H H
charge: 0.918707 0.978353 -0.320149 -0.542061 -0.552313 -0.535977 -0.547325 -0.481252 -0.028767 -0.498127 0.233300 0.237950 0.239218 -0.083309 -0.087198 -0.124358 -0.329336 -0.323560 0.270996 -0.291205 -0.377790 -0.307314 0.158855 -0.276601 -0.255863 0.295334 -0.228588 -0.404749 -0.397589 -0.740000 -0.760324 -0.530296 0.349267 0.317070 0.278584 0.289781 0.233636 0.271577 0.273450 0.234645 0.301410 0.238862 0.235393 0.264873 0.270400 0.294513 0.272431 0.267386 0.297862 0.273302 0.233556 0.250201 0.243143
chargesum: 0.00000
title: Mulliken charges with hydrogens summed into heavy atoms:
elementType: S S O O O O O N N N C C C C C C C C C C C C C C C C C C C C C C
charge: 0.918707 0.978353 -0.320149 -0.542061 -0.552313 -0.535977 -0.547325 -0.131985 -0.028767 -0.225696 0.233300 0.237950 0.239218 -0.083309 -0.087198 -0.124358 -0.012266 -0.044977 0.270996 -0.001424 -0.144155 -0.035737 0.158855 -0.003151 -0.021218 0.295334 0.010275 -0.103340 -0.162197 0.089786 0.078225 0.196604
polarizability: 6.15400157e+02 -9.35949316e+01 5.01140131e+02 1.33000190e+01 -3.06926462e+00 2.14937778e+02
1716.lowfreq: -0.5512 -0.0019 -0.0010 0.0003 4.5830 6.1614 15.3505 16.2507 21.0817
frequency: 15.3364 16.1820 21.0553 27.4668 36.5119 42.5566 52.4856 58.0921 88.6131 92.6845 101.6256 114.1233 121.6400 125.5043 131.8124 148.7240 154.6298 159.6758 171.9393 179.7615 192.9302 207.7240 212.9273 220.7189 238.7497 247.2947 266.0371 269.1430 285.5754 300.6188 315.3095 325.7379 345.4023 355.6294 367.2526 381.5495 391.0966 406.5683 410.2509 428.5855 449.8591 457.6465 479.1099 484.8362 527.1893 528.8966 538.4545 541.1852 557.4406 577.1496 594.5396 605.8886 619.4141 627.1285 644.1729 653.8802 679.1104 705.2630 713.5932 719.6058 747.3301 770.0563 785.9733 789.1245 800.1594 804.2455 806.9431 835.0384 840.1570 856.5125 862.1044 876.2918 885.5052 890.4823 891.4752 922.1717 925.4875 929.5784 934.1484 946.2736 967.8482 971.2515 977.7238 998.9227 999.6282 1006.2704 1008.2372 1023.0206 1045.9418 1078.0549 1118.2633 1118.5273 1124.8855 1156.2672 1159.7491 1176.8977 1180.4599 1189.7249 1215.8530 1227.1153 1237.6314 1263.8038 1281.1579 1283.1894 1291.5492 1301.6736 1313.6936 1337.4516 1359.3993 1384.5399 1393.1958 1407.9415 1407.9977 1415.9708 1421.3921 1424.4350 1430.0528 1434.1083 1446.9617 1453.3216 1467.5637 1467.9499 1474.9099 1483.6394 1512.0129 1528.5165 1544.4970 1552.8777 1577.1034 1600.3196 1606.0161 1625.2188 2978.9618 3029.1030 3029.4056 3075.1109 3130.1224 3131.9394 3136.2155 3143.4539 3152.0793 3159.7923 3162.5334 3170.6698 3174.8736 3175.8187 3179.1411 3179.3879 3183.6554 3183.8522 3192.9691 3350.5654 3475.8705
redmass: 6.3409 7.3029 6.0354 5.8017 5.4543 5.1329 5.4022 5.1228 4.9641 4.9623 4.5314 3.9466 4.4690 6.4276 4.5649 1.4593 1.1060 2.7601 4.2135 4.4611 5.1817 5.9444 2.3396 3.3717 3.9033 3.3286 5.0913 3.0571 4.7666 5.3405 7.5664 6.2612 6.7944 6.1775 7.3845 7.4146 4.4698 3.9885 4.1995 6.3436 4.2316 3.5265 3.4063 4.7522 4.5772 5.6307 6.2209 6.1350 6.1758 6.5376 3.8744 2.8542 4.5873 4.9740 3.1441 2.8199 6.2515 5.0686 5.2017 3.8757 3.6026 1.5592 4.6666 5.7126 2.1901 1.8268 4.9352 1.7222 1.6366 4.1278 1.6553 1.9169 3.3133 3.9166 2.2635 1.8190 2.6661 3.3775 1.7248 1.3227 1.3604 1.3482 1.3255 1.3457 3.3962 2.5435 1.8759 2.1447 2.1173 4.5441 1.9298 1.3083 1.9166 1.3605 1.3174 1.8358 1.3006 1.1891 1.5973 1.7635 3.0078 1.5532 1.4053 1.8163 3.4339 1.1402 2.4200 2.0363 2.9178 3.9662 4.7737 1.0533 1.0584 1.0572 1.0576 2.6354 4.6120 1.6886 3.1318 2.2960 1.2766 1.3585 1.7207 1.7240 3.9577 7.5685 5.5141 8.0582 3.9793 6.5848 6.2865 6.4317 1.0318 1.0239 1.0246 1.1049 1.0859 1.0897 1.1017 1.0896 1.0881 1.0952 1.0926 1.0947 1.0997 1.0958 1.1071 1.1072 1.1079 1.1081 1.0922 1.0754 1.0743
irintensity: 3.0238 1.6443 1.0319 3.6565 1.2369 5.1842 3.1377 1.2893 0.9933 2.0970 27.7756 6.9649 1.9889 63.5085 1.6803 2.7784 2.0712 3.3160 3.0463 21.0957 6.1480 2.6858 1.4635 16.3562 1.9369 3.3561 6.6549 2.5816 4.1976 6.4805 9.3734 9.2572 22.3787 10.6010 51.9139 22.7927 42.4548 82.6848 0.1848 17.8450 6.4936 1.2739 0.9125 16.8156 6.3163 2.4113 33.3703 33.3270 12.8831 43.3237 62.1021 54.4450 7.1809 25.9120 102.7886 34.0124 20.4669 3.2526 13.6432 8.7606 5.5678 77.4307 41.5063 37.0057 25.0107 4.4539 103.0209 125.7953 14.8143 17.9772 22.7186 2.1191 24.9452 7.9981 16.0249 13.9482 8.3141 3.3499 5.4399 151.8650 0.9546 76.3211 1.0124 0.9454 51.8933 64.0611 46.1400 8.1148 47.3875 6.9091 3.5439 9.6608 94.6530 1.7474 2.0652 57.5996 12.7527 0.7442 9.5656 10.3047 11.6605 11.2759 21.4541 14.4824 29.0866 4.3987 65.7107 14.6126 153.5542 33.9572 66.9632 10.3529 5.9816 11.0034 15.3525 40.6192 149.9673 5.3340 8.8710 3.4922 46.9986 58.4040 61.5515 147.7695 520.4187 49.6981 96.3609 108.6346 50.2361 54.7830 227.5932 19.4174 49.2993 0.6866 1.1759 24.8789 0.2703 7.6802 15.7255 11.7202 8.8001 18.9264 7.6768 9.1699 30.2888 1.4960 1.0105 0.1530 1.0078 0.9677 1.1251 11.6055 71.4527
temp: 298.150 k
press: 1.00000 atm
elementType: 16 16 8 8 8 8 8 7 7 7 6 6 6 6 6 6 6 6 6 6 6 6 6 6 6 6 6 6 6 6 6 6 1 1 1 1 1 1 1 1 1 1 1 1 1 1 1 1 1 1 1 1 1
symmnumber: 1
zpe: 1021031.9 jmol-1
zpe.correction: 0.388891 hartree
zpe.thermalcorrener: 0.420719 hartree
zpe.thermalcorrenthalpy: 0.421663 hartree
zpe.thermalcorrgfe: 0.322649 hartree
zpe.sumelectzpe: -2184.811214 hartree
zpe.sumelectthermal: -2184.779386 hartree
zpe.sumelectthermalent: -2184.778442 hartree
zpe.sumelectthermalfe: -2184.877455 hartree
dipole: -2.1611 5.6456 4.6219
dipole: 7.6095
quadrupole: -265.6852 -189.5606 -198.8291
quadrupole: -8.6955 -14.1063 -10.6141
quadrupole: -47.6603 28.4644 19.1959 -8.6955 -14.1063 -10.6141
hfenergy: -2185.2001046 hartree
pointgroup: C01 [X(C22H21N3O5S2)]
dipole: 0.7622847 1.7611321 -2.2978713 debye
polarizability: 589.8405023|110.7019592|508.0404848|16.062204|-64.5727988|233.5970785 unknown
InChI: InChI=1S/C22H21N3O5S2/c1-30-21-12-14(25-32(3,28)29)8-11-19(21)24-22-16-6-4-5-7-18(16)23-20-13-15(31(2,26)27)9-10-17(20)22/h4-13,24-25H,1-3H3
charge 0 multiplicity 1
53 atoms
S  4.373348 -3.410545 1.249989
S  -5.765287 -2.531719 0.411364
O  -2.62088 1.414729 -2.200451
O  5.452634 -2.881342 2.35806
O  3.302036 -4.608912 1.567515
O  -7.069393 -3.041642 1.236376
O  -5.860285 -2.0867 -1.15351
N  -0.360887 1.333958 -0.879998
N  3.754265 1.697322 0.338472
N  -5.048998 -0.872379 1.401775
C  0.981858 1.419293 -0.455799
C  1.751389 0.264777 -0.093131
C  1.6194 2.704969 -0.459384
C  3.132651 0.478995 0.33662
C  3.025313 2.782534 -0.076326
C  3.358114 -1.916948 0.656516
C  3.916699 -0.658515 0.750859
C  1.253158 -1.082461 -0.186371
C  -1.453081 0.713524 -0.251238
C  2.037905 -2.17104 0.182956
C  0.930775 3.92242 -0.793998
C  3.687894 4.058888 -0.105422
C  -2.704586 0.765454 -0.957552
C  -1.42685 0.114777 1.035021
C  1.6037 5.142638 -0.805963
C  -3.830818 -0.389354 0.879781
C  2.998668 5.210825 -0.471558
C  -3.875146 0.239821 -0.40298
C  -2.588591 -0.463129 1.577416
C  5.375967 -3.955172 -0.290087
C  -4.436597 -3.937333 0.482223
C  -3.852005 1.518457 -2.997131
H  -0.636552 1.908638 -1.683997
H  4.925235 -0.48613 1.139422
H  0.241935 -1.255752 -0.562619
H  1.661912 -3.198484 0.145734
H  -0.142123 3.899983 -1.014073
H  4.744395 4.076755 0.177978
H  -0.495257 0.098653 1.606627
H  1.063517 6.061816 -1.056669
H  -4.837196 0.288987 -0.916905
H  3.511477 6.178364 -0.489198
H  -2.54447 -0.940958 2.563502
H  4.649749 -4.206561 -1.075102
H  6.028034 -3.11403 -0.561833
H  5.946309 -4.833005 0.044472
H  -4.974713 -1.218103 2.379865
H  -4.390482 -4.273332 1.527071
H  -4.813144 -4.718452 -0.192813
H  -3.494631 -3.49769 0.1265
H  -4.610733 2.126075 -2.469761
H  -4.26125 0.51511 -3.215057
H  -3.551481 2.016326 -3.930086
