program: Gaussian 09
title: 000150472
version: EM64L-G09RevD.01
frameworkgroup: C1[X(C16H9N3)]
method: RPBEPBE
basis: SDD
operation: Freq
keyword: #pfreq=noraman
keyword: PBEPBE/SDD
title: #p freq=noraman PBEPBE/SDD
converged: YES YES NO YES
title: Mulliken charges:
elementType: N N N C C C C C C C C C C C C C C C C H H H H H H H H H
charge: -0.024538 0.030214 0.030205 0.360042 0.251184 0.225883 -0.097182 -0.097412 -0.285752 -0.366153 -0.328914 -0.302057 -0.308591 -0.263841 -0.274639 -0.233306 -0.227826 -0.159838 -0.159836 0.281735 0.205953 0.245279 0.273711 0.271801 0.235383 0.237956 0.240762 0.239776
chargesum: 0.00000
title: Mulliken charges with hydrogens summed into heavy atoms:
elementType: N N N C C C C C C C C C C C C C C C C
charge: -0.024538 0.030214 0.030205 0.360042 0.251184 0.225883 -0.097182 -0.097412 -0.004017 -0.160199 -0.083636 -0.028347 -0.036790 -0.028458 -0.036684 0.007457 0.011951 -0.159838 -0.159836
polarizability: 2.88038763e+02 -2.36301044e+01 2.02420404e+02 -1.65550331e-03 1.49028584e-03 1.03324801e+02
1716.lowfreq: -5.7747 -2.8049 -0.0010 -0.0006 -0.0001 5.2816 32.2520 56.4054 88.1629
frequency: 32.2036 56.3995 88.1624 106.3228 108.2756 114.7390 173.6824 237.5218 237.7497 266.9133 311.3361 354.0545 374.5940 395.5026 405.8258 428.7462 456.9776 476.9316 499.3983 536.6390 563.8156 577.8477 598.4197 631.5439 635.3012 650.1336 701.1860 750.6157 759.7356 770.7906 803.9752 805.0431 860.5455 866.0084 878.9770 894.6286 930.1606 963.8629 971.2021 998.9269 1000.8015 1005.3261 1020.7810 1022.9718 1036.3412 1113.2222 1147.3879 1164.6791 1188.8000 1213.9673 1247.7898 1261.4393 1261.9734 1288.7623 1310.6850 1330.1438 1362.6038 1393.7947 1414.1866 1445.2650 1457.8034 1484.8339 1529.8140 1550.5852 1553.1095 1611.5268 1634.7651 2199.9914 2203.4962 3026.1833 3122.0737 3138.6280 3143.9420 3149.4826 3159.5195 3164.3731 3176.2892 3176.7109
redmass: 9.2257 6.0168 5.4895 10.5063 3.8711 10.8082 5.8314 4.6306 5.1095 8.1627 6.2646 7.9028 8.7162 4.0157 7.0184 5.5419 6.0808 2.7895 3.2925 7.0790 12.3756 3.6827 7.0472 7.0380 4.5960 6.4763 5.7760 3.1268 1.4751 1.3711 2.3795 7.0447 6.5442 1.6665 2.0074 6.6587 6.3276 1.3706 1.3573 1.3414 1.3494 4.1688 2.3380 2.2088 4.5661 2.0828 1.3571 1.2320 1.1740 1.4048 1.6672 1.3023 2.1694 1.7320 3.8465 3.1584 2.3203 2.3157 8.0301 2.5704 3.0911 2.7853 7.2452 7.4465 6.9767 5.8211 6.3579 12.5563 12.6062 1.0786 1.0866 1.0856 1.0891 1.0892 1.0943 1.0958 1.1001 1.1002
irintensity: 0.2965 1.6656 1.8331 6.3532 0.6743 3.3002 1.3152 0.0005 0.3460 2.4792 0.2836 0.0869 3.2795 4.7246 0.1199 0.4040 4.6253 0.0004 0.0132 3.9153 0.7812 1.9504 7.5424 12.0651 9.3073 0.6181 8.4900 4.4907 111.9780 42.9589 11.8738 0.1523 5.2213 2.1110 4.1001 8.3516 1.6326 0.0557 0.3208 0.8188 0.0569 14.2647 7.4617 3.2901 4.8123 0.0721 14.6609 2.1395 0.4322 2.4897 0.7071 1.0274 10.3758 1.9561 3.3190 0.3247 2.0980 0.5623 33.9965 27.3400 4.9022 0.5766 26.6991 2.6535 0.0758 0.6562 0.8146 1.2899 3.3615 8.4803 11.1079 0.5996 12.9394 9.4288 17.3715 15.9227 38.0901 3.6414
temp: 298.150 k
press: 1.00000 atm
elementType: 7 7 7 6 6 6 6 6 6 6 6 6 6 6 6 6 6 6 6 1 1 1 1 1 1 1 1 1
symmnumber: 1
zpe: 532270.9 jmol-1
zpe.correction: 0.202731 hartree
zpe.thermalcorrener: 0.217438 hartree
zpe.thermalcorrenthalpy: 0.218382 hartree
zpe.thermalcorrgfe: 0.160304 hartree
zpe.sumelectzpe: -778.060954 hartree
zpe.sumelectthermal: -778.046247 hartree
zpe.sumelectthermalent: -778.045303 hartree
zpe.sumelectthermalfe: -778.103381 hartree
dipole: 3.0068 1.1062 -0.0002
dipole: 3.2038
quadrupole: -93.7968 -107.0453 -127.1161
quadrupole: -17.0232 -0.0015 0.0007
quadrupole: 15.5226 2.2741 -17.7967 -17.0232 -0.0015 0.0007
hfenergy: -778.2636852 hartree
pointgroup: C01 [X(C16H9N3)]
dipole: -1.1897191 0.4164073 0.0000204 debye
polarizability: 287.2688925|24.9740623|203.1902608|-0.0215374|-0.0353642|103.3248142 unknown
InChI: InChI=1S/C16H9N3/c17-9-11(10-18)16-12-5-1-3-7-14(12)19-15-8-4-2-6-13(15)16/h1-8,11H
charge 0 multiplicity 1
28 atoms
N  -0.987385 2.105872 -0.000529
N  1.950735 -2.612565 -2.226229
N  1.951479 -2.611221 2.227626
C  0.0358 -0.582571 0.000247
C  -1.374034 -0.358533 0.000267
C  0.934983 0.524394 -0.000205
C  -1.835413 1.033986 -0.000133
C  0.359863 1.869889 -0.000577
C  0.583985 -2.02838 0.000753
C  -2.381567 -1.391296 0.000635
C  2.370647 0.403675 -0.000309
C  -3.246988 1.315708 -0.000103
C  1.23223 3.013843 -0.001018
C  -3.737611 -1.079741 0.000628
C  3.182745 1.533251 -0.000753
C  -4.179927 0.286931 0.000266
C  2.612416 2.852269 -0.001107
C  1.36334 -2.345501 -1.22414
C  1.363869 -2.344442 1.225586
H  -0.27148 -2.728246 0.001248
H  -2.099885 -2.450023 0.000892
H  2.842412 -0.583388 -0.000058
H  -3.538819 2.369948 -0.000396
H  0.75816 3.999625 -0.00128
H  -4.47904 -1.885859 0.000894
H  4.271585 1.417099 -0.000843
H  -5.252079 0.508784 0.000277
H  3.272482 3.725993 -0.001441
