program: Gaussian 09
title: 000150466
version: EM64L-G09RevD.01
frameworkgroup: C1[X(C18H13N3O)]
method: RPBEPBE
basis: SDD
operation: Freq
keyword: #p
keyword: freq=noraman
keyword: PBEPBE/SDD
title: #p freq=noraman PBEPBE/SDD
converged: YES YES NO YES
title: Mulliken charges:
elementType: O N N N C C C C C C C C C C C C C C C C C C H H H H H H H H H H H H H
charge: -0.296737 -0.498644 -0.012156 -0.394295 0.101321 0.274158 0.274032 -0.106842 -0.106844 -0.369058 -0.369009 0.431513 -0.303579 -0.303572 -0.251994 -0.252001 -0.228673 -0.228671 -0.499321 0.218226 -0.205106 -0.286045 0.324081 0.267107 0.267136 0.269665 0.269664 0.237041 0.237043 0.238755 0.238755 0.243638 0.336897 0.236502 0.247015
chargesum: 0.00000
title: Mulliken charges with hydrogens summed into heavy atoms:
elementType: O N N N C C C C C C C C C C C C C C C C C C
charge: -0.296737 -0.174564 -0.012156 -0.057399 0.101321 0.274158 0.274032 -0.106842 -0.106844 -0.101951 -0.101873 0.431513 -0.033914 -0.033909 -0.014953 -0.014958 0.010082 0.010084 -0.255683 0.218226 0.031396 -0.039030
polarizability: 3.01350982e+02 2.06290879e-04 2.96382572e+02 2.84991305e+01 6.39233995e-03 1.32174975e+02
1716.lowfreq: -56.5668 -3.3630 -0.0006 -0.0002 0.0007 4.8341 6.9304 14.9483 53.3096
frequency: -56.5663 14.6096 53.3088 84.3661 113.4017 143.3446 164.7438 165.1494 190.8657 207.6570 251.1615 276.1354 315.6561 334.9367 396.3094 406.7112 418.9680 437.0490 447.3472 479.9501 500.5160 506.5005 536.7889 564.4345 567.6560 570.3907 587.0592 604.6895 631.0498 639.5524 665.1943 691.4864 707.2072 750.4656 758.9209 783.2750 787.4058 795.4035 814.2534 833.5922 841.8082 854.1170 883.9431 891.1565 917.6433 919.8711 936.3661 971.3854 979.3146 979.6239 1002.9916 1003.1625 1012.0191 1013.9661 1069.1905 1076.2798 1109.6105 1149.4403 1159.9727 1177.2828 1207.9950 1217.6948 1231.1564 1246.7856 1267.0292 1283.2608 1293.3237 1346.4357 1358.5978 1365.5418 1386.8623 1391.5789 1403.5833 1427.9851 1440.2804 1458.2220 1480.5700 1507.9146 1523.5986 1543.0289 1548.9250 1551.1183 1602.3716 1608.8986 1633.0578 1654.8403 3136.0663 3136.2489 3147.4404 3147.4999 3157.8912 3162.2031 3162.2986 3162.5249 3174.5480 3174.9730 3190.2887 3544.6097 3563.0312
redmass: 3.9042 7.0780 5.5345 5.0087 3.6415 3.9410 4.3011 5.0140 6.2318 2.1111 2.3250 5.7252 5.9924 4.5995 6.3749 3.7745 2.9069 6.2061 5.6604 2.9077 3.2173 8.2235 5.0708 1.2723 6.7848 5.7196 3.7210 6.8596 5.4720 6.4168 5.7209 2.3483 4.9847 3.4848 2.6364 1.3653 2.0595 1.3410 3.0751 1.9745 5.4575 6.2253 1.4973 1.8586 3.0085 6.9141 1.2777 5.3365 1.3471 1.3460 1.3240 1.3275 2.2639 2.0476 2.5121 2.3754 1.9668 1.3635 1.1668 1.1276 1.3004 1.4621 1.4528 2.8607 2.8004 1.7053 5.5298 2.3481 2.0900 2.0831 2.5861 2.2339 2.2365 5.6213 2.9799 3.2990 3.1951 4.2133 7.0007 7.6135 7.1503 6.1803 3.3060 5.9435 6.4397 6.4622 1.0857 1.0857 1.0893 1.0894 1.0920 1.0881 1.0960 1.0960 1.0999 1.1000 1.1001 1.0777 1.0764
irintensity: 2.0023 4.4603 2.7411 1.3552 1.3116 6.1901 8.6544 5.4254 6.2151 20.9588 16.1435 2.0146 1.9445 25.7169 2.0787 10.1337 10.0588 0.2573 4.9267 4.8382 0.3012 9.3563 5.4669 18.2086 6.9314 5.8739 1.6107 12.1533 24.2410 3.9086 3.7359 14.0802 9.9126 0.0384 66.0586 0.0839 104.6741 2.7618 12.4864 75.1688 2.2014 2.2875 0.1504 0.0766 0.7098 1.3592 0.4760 31.9235 3.1557 0.0263 0.0142 0.1542 2.6039 10.9647 15.4666 5.0650 0.0186 8.5043 3.8808 3.8178 62.0144 0.4455 8.0027 1.1978 9.9489 0.3964 0.0047 9.1952 95.5317 2.0946 0.0669 2.4408 16.8900 143.7216 31.5463 0.3197 12.2569 130.8901 31.1704 3.2824 100.2053 113.2587 278.3047 2.9758 2.6390 516.8520 3.9455 0.0683 4.0345 6.5135 6.2116 2.1479 14.5927 14.9201 44.8453 6.2952 8.8438 71.5926 53.1839
temp: 298.150 k
press: 1.00000 atm
elementType: 8 7 7 7 6 6 6 6 6 6 6 6 6 6 6 6 6 6 6 6 6 6 1 1 1 1 1 1 1 1 1 1 1 1 1
symmnumber: 1
zpe: 699737.3 jmol-1
zpe.correction: 0.266516 hartree
zpe.thermalcorrener: 0.282689 hartree
zpe.thermalcorrenthalpy: 0.283633 hartree
zpe.thermalcorrgfe: 0.222131 hartree
zpe.sumelectzpe: -931.713842 hartree
zpe.sumelectthermal: -931.697669 hartree
zpe.sumelectthermalent: -931.696725 hartree
zpe.sumelectthermalfe: -931.758226 hartree
dipole: 7.0430 0.0002 1.1595
dipole: 7.1378
quadrupole: -179.0890 -106.6992 -119.0472
quadrupole: -0.0035 -7.1524 0.0066
quadrupole: -44.1439 28.2459 15.8980 -0.0035 -7.1524 0.0066
hfenergy: -931.9803579 hartree
pointgroup: C01 [X(C18H13N3O1)]
dipole: 2.7629742 0.0013099 -0.5020506 debye
polarizability: 300.3601488|0.0080495|296.3825695|-31.2864774|0.0246703|133.1658108 unknown
InChI: InChI=1S/C18H13N3O/c22-12-9-10-19-17(11-12)21-18-13-5-1-3-7-15(13)20-16-8-4-2-6-14(16)18/h1-11,19,21H
charge 0 multiplicity 1
35 atoms
O  -5.731429 -0.002591 0.672629
N  -0.876271 -0.000449 1.166862
N  3.119967 0.001416 -0.474822
N  -1.918339 -0.001127 -0.967979
C  0.448513 0.000194 0.604252
C  1.110572 1.233919 0.333724
C  1.11156 -1.232923 0.333382
C  2.467233 1.177454 -0.213284
C  2.468174 -1.175217 -0.213624
C  0.50789 2.51833 0.573724
C  0.509909 -2.517878 0.573054
C  -2.063196 -0.00081 0.418566
C  3.156101 2.41075 -0.489585
C  3.158016 -2.407889 -0.490281
C  1.207547 3.687786 0.291842
C  1.210491 -3.686696 0.290835
C  2.542384 3.634657 -0.243533
C  2.545275 -3.63235 -0.244561
C  -3.332875 -0.000945 0.985408
C  -4.550462 -0.001095 0.170786
C  -3.03679 -0.001829 -1.804972
C  -4.309687 -0.002039 -1.290271
H  -0.978414 -0.000025 2.181708
H  -0.508529 2.555758 0.978876
H  -0.506447 -2.556186 0.978275
H  4.169362 2.337976 -0.895729
H  4.171213 -2.334199 -0.896422
H  0.741641 4.661639 0.476768
H  0.745378 -4.660973 0.47552
H  3.073216 4.568751 -0.456434
H  3.076849 -4.565962 -0.457725
H  -3.44696 -0.000809 2.073932
H  -0.978655 -0.000999 -1.368761
H  -2.820718 -0.002281 -2.876706
H  -5.176718 -0.002756 -1.956154
