program: Gaussian 09
title: 000150455
version: EM64L-G09RevD.01
frameworkgroup: C1[X(C16H27N3O3)]
method: RPBEPBE
basis: SDD
operation: Freq
keyword: #p
keyword: freq=noraman
keyword: PBEPBE/SDD
title: #p freq=noraman PBEPBE/SDD
converged: YES YES NO NO
title: Mulliken charges:
elementType: O O O N N N C C C C C C C C C C C C C C C C H H H H H H H H H H H H H H H H H H H H H H H H H H H
charge: -0.213085 -0.417241 -0.237620 -0.362204 -0.661412 -0.595250 -0.079129 0.209088 -0.455442 -0.096039 -0.793981 0.106881 -0.517974 -0.277207 -0.269160 -0.174266 -0.374564 -0.190209 -0.203168 -0.646423 -0.506112 0.193521 0.246632 0.248620 0.221913 0.207885 0.239930 0.230660 0.198095 0.258370 0.264447 0.318417 0.314593 0.236736 0.221329 0.219054 0.189705 0.229285 0.230490 0.202888 0.204471 0.200888 0.218747 0.241095 0.261006 0.246513 0.265490 0.269221 0.374515
chargesum: 0.00000
title: Mulliken charges with hydrogens summed into heavy atoms:
elementType: O O O N N N C C C C C C C C C C C C C C C C
charge: -0.213085 -0.042726 -0.237620 -0.103834 -0.078548 -0.060539 0.167503 0.209088 0.015091 0.111847 -0.125296 0.106881 0.033355 -0.055878 -0.050106 0.015439 0.085211 0.012679 0.001303 0.014306 0.001408 0.193521
polarizability: 2.04861369e+02 2.44765009e+01 2.18461022e+02 1.25245559e+01 -7.41616962e-01 1.67908675e+02
1716.lowfreq: -0.0007 -0.0005 0.0002 1.9196 4.7501 11.4127 11.9027 20.6495 26.9533
frequency: 11.3244 20.5710 26.6292 33.3131 38.3387 49.7466 71.9876 75.1427 90.3222 103.2350 106.3050 117.8160 134.0820 142.8946 168.5584 173.5926 192.8905 202.2397 229.2414 246.5435 251.2164 264.5090 285.0930 308.7803 319.3962 337.0413 352.3016 381.3766 406.3809 435.1105 457.0732 471.7115 481.7908 496.3942 503.9774 509.2027 532.1585 550.0553 560.9498 570.2781 576.5671 607.9219 641.9435 649.4019 662.9793 731.0052 738.9617 743.8776 766.4586 806.7633 820.5680 866.9450 873.6324 881.7386 907.6301 912.5189 927.8639 952.6804 958.7702 982.2642 985.3167 998.8211 1006.2506 1026.7536 1034.8303 1038.7678 1072.6493 1079.4623 1084.7355 1086.3278 1100.6326 1104.6822 1116.0146 1119.4547 1143.1742 1151.5628 1162.4983 1172.4067 1189.1483 1207.8466 1208.4699 1214.6553 1246.8216 1252.0807 1261.4685 1278.1969 1285.0042 1296.8369 1305.7992 1314.7409 1338.6415 1341.7345 1364.0346 1364.2199 1370.8714 1375.7327 1390.2385 1404.0884 1433.3883 1434.5800 1436.1901 1442.7225 1459.4983 1461.2806 1463.5149 1474.9413 1487.6403 1500.4864 1570.8660 1628.8445 1629.0167 1661.0018 1666.8022 1700.9859 2795.6686 2913.4023 2935.3208 2966.3190 2972.8074 2975.2710 2992.5263 2998.6538 3015.4755 3017.3084 3033.5573 3036.7449 3044.5115 3058.8072 3076.8631 3079.3488 3079.9018 3081.1098 3083.2434 3111.9692 3118.2029 3431.9520 3473.2570 3482.1838 3510.5509 3564.5069 3631.6631
redmass: 5.7403 4.5356 3.8381 9.4667 3.5981 4.4161 4.2307 5.0165 2.6913 2.0944 1.0523 2.8164 1.8927 1.7329 1.9172 2.8725 2.6529 1.8452 2.7441 3.6972 3.3812 2.6034 1.6175 2.8350 2.9136 2.7489 2.3892 3.3301 2.3787 2.4802 3.0145 4.0257 3.7013 1.6987 1.9083 1.8814 2.0181 2.0753 1.5866 5.4159 4.0142 2.3891 1.3671 3.0681 2.3803 1.9797 1.9623 1.3154 3.2805 2.4444 2.8811 2.4060 2.5950 2.6487 2.2210 2.2584 2.2120 1.9959 2.5381 1.2996 1.2892 2.3494 1.8777 2.2163 2.1785 2.9468 2.0687 2.0639 3.1636 2.6555 1.7578 1.8115 1.6899 1.9037 2.6336 1.4277 1.1581 1.0408 2.5157 1.3794 1.1282 1.3966 1.3779 1.6242 1.8100 1.1748 1.2114 1.2412 1.5384 1.4222 1.3631 1.3340 1.7948 1.8745 1.6481 1.2259 2.3207 1.5390 1.2023 1.1404 1.0948 1.1174 1.0487 1.0852 1.0877 1.0581 1.0601 1.0480 1.4501 3.0219 1.0995 7.7041 7.9960 7.2217 1.0781 1.0495 1.0794 1.0659 1.0576 1.0387 1.0613 1.0827 1.0637 1.0839 1.0909 1.1005 1.0960 1.0965 1.1018 1.0982 1.0964 1.0854 1.0841 1.0978 1.0996 1.0444 1.0463 1.0743 1.0639 1.0975 1.0981
irintensity: 0.2332 0.2712 0.4040 1.5545 1.4038 1.0625 0.4032 1.7383 1.1259 1.8691 45.8172 1.1485 2.4110 3.1410 2.7391 2.5813 5.6709 2.8919 1.9026 31.1998 0.5135 10.1431 50.3589 8.5241 2.1540 7.7327 3.1381 3.4785 28.6235 35.5874 11.5442 55.5277 1.8819 56.7554 32.6100 24.3942 76.8998 54.1238 152.8518 7.7487 8.9668 10.4017 133.3165 2.4860 19.0637 68.9634 13.1744 0.8463 3.3231 2.3112 3.8723 4.5752 7.4234 57.5498 21.9497 0.7914 13.7385 6.6488 16.4512 1.7557 0.6960 16.7174 13.2672 64.9099 58.0214 218.5741 1.7324 10.0001 26.7281 3.7054 3.7869 29.7438 13.0425 7.5794 47.1374 14.3686 1.0800 1.1063 23.7142 0.5132 2.5481 9.7123 9.2432 7.2525 6.4744 2.1748 41.1950 11.4680 35.8377 0.7638 0.6173 0.6284 1.8603 61.1033 4.9639 23.1085 0.5406 7.0324 30.1600 7.3930 24.6297 13.7484 9.8769 1.4620 26.3448 9.3129 7.1648 21.7381 134.2493 38.8324 43.3601 4.1468 185.7709 1.9150 96.0839 117.2078 19.3575 18.7011 33.3143 23.5575 16.2302 10.3007 13.6545 34.4346 0.9393 30.6648 12.5275 60.1139 20.8067 27.2856 30.1292 0.8188 21.6962 89.2720 0.8254 5.3316 20.0579 1.0704 21.4920 0.0123 15.7717
temp: 298.150 k
press: 1.00000 atm
elementType: 8 8 8 7 7 7 6 6 6 6 6 6 6 6 6 6 6 6 6 6 6 6 1 1 1 1 1 1 1 1 1 1 1 1 1 1 1 1 1 1 1 1 1 1 1 1 1 1 1
symmnumber: 1
zpe: 1083505.2 jmol-1
zpe.correction: 0.412685 hartree
zpe.thermalcorrener: 0.438458 hartree
zpe.thermalcorrenthalpy: 0.439402 hartree
zpe.thermalcorrgfe: 0.353731 hartree
zpe.sumelectzpe: -1014.042217 hartree
zpe.sumelectthermal: -1014.016445 hartree
zpe.sumelectthermalent: -1014.015501 hartree
zpe.sumelectthermalfe: -1014.101171 hartree
dipole: -0.3269 0.9695 -1.5616
dipole: 1.8669
quadrupole: -141.6005 -112.3451 -134.3301
quadrupole: 4.4804 11.5081 5.1630
quadrupole: -12.1753 17.0801 -4.9049 4.4804 11.5081 5.1630
hfenergy: -1014.4549027 hartree
pointgroup: C01 [X(C16H27N3O3)]
dipole: -0.1171993 -0.4325036 0.5819815 debye
polarizability: 204.8643746|-23.4079158|217.8345893|-15.0436039|3.665933|168.5321013 unknown
InChI: InChI=1S/C16H27N3O3/c1-11(10-12-6-8-13(17)9-7-12)16(18,19-2)14(20)4-3-5-15(21)22/h6-9,11-13,19,21H,3-5,10,17-18H2,1-2H3
charge 0 multiplicity 1
49 atoms
O  -1.642685 1.369226 -2.082289
O  -3.759011 -4.103333 0.652916
O  -4.47858 -1.907093 0.454206
N  -2.093397 2.145344 1.227524
N  -0.842655 3.393522 -0.55855
N  5.309535 -2.492862 -0.043844
C  0.316546 1.68203 0.866806
C  -1.034196 2.137475 0.176444
C  1.376942 1.34987 -0.215877
C  2.757867 0.838863 0.317586
C  0.838986 2.769998 1.835114
C  -1.4782 1.055513 -0.872429
C  -1.748375 -0.350884 -0.359668
C  3.710825 0.631549 -0.844722
C  2.629598 -0.413438 1.166095
C  4.014243 -1.849737 -0.407579
C  -2.329621 -1.286364 -1.435733
C  4.272139 -0.559542 -1.166349
C  3.191871 -1.605938 0.846938
C  -3.435018 2.610085 0.824836
C  -2.567833 -2.716421 -0.915325
C  -3.68527 -2.809786 0.107782
H  0.077255 0.77174 1.451003
H  1.531773 2.263727 -0.82302
H  0.988101 0.576578 -0.907557
H  3.17915 1.646867 0.956407
H  1.11139 3.681226 1.272161
H  1.737773 2.418942 2.372039
H  0.10303 3.047406 2.613729
H  -1.764362 2.574299 2.099343
H  -0.951458 4.253435 -0.021709
H  -1.22501 3.397643 -1.508659
H  -2.420384 -0.255004 0.514089
H  -0.798445 -0.763435 0.041587
H  3.928479 1.518417 -1.456917
H  2.053827 -0.324879 2.098069
H  3.409624 -2.515199 -1.082077
H  -1.642978 -1.325794 -2.300925
H  -3.278486 -0.863666 -1.811851
H  4.946682 -0.630388 -2.032582
H  3.063326 -2.468032 1.518206
H  -3.44799 3.618362 0.352078
H  -4.089961 2.630134 1.713199
H  -3.884771 1.900857 0.104841
H  -2.836822 -3.395798 -1.748266
H  -1.652999 -3.146114 -0.463623
H  5.197285 -3.387365 0.447274
H  5.959743 -2.572464 -0.834184
H  -4.51178 -4.139475 1.304061
