program: Gaussian 09
title: 000150448
version: EM64L-G09RevD.01
frameworkgroup: C1[X(C18H20N2O4)]
method: RPBEPBE
basis: SDD
operation: Freq
keyword: #p
keyword: freq=noraman
keyword: PBEPBE/SDD
title: #p freq=noraman PBEPBE/SDD
converged: YES YES NO NO
title: Mulliken charges:
elementType: O O O O N N C C C C C C C C C C C C C C C C C C H H H H H H H H H H H H H H H H H H H H
charge: -0.245654 -0.211485 -0.212163 -0.199837 -0.088196 -0.064796 -0.345696 -0.348693 -0.388179 -0.380109 -0.543342 0.351422 0.093476 0.281967 -0.613651 0.013228 -0.011534 0.001151 -0.387763 -0.259679 -0.181146 -0.334254 0.112091 -0.508239 0.190365 0.225550 0.203318 0.191897 0.190799 0.209925 0.208386 0.184478 0.214041 0.232628 0.223974 0.189968 0.222518 0.263681 0.294640 0.266969 0.247909 0.232595 0.234134 0.243308
chargesum: 0.00000
title: Mulliken charges with hydrogens summed into heavy atoms:
elementType: O O O O N N C C C C C C C C C C C C C C C C C C
charge: -0.245654 -0.211485 -0.212163 -0.199837 -0.088196 -0.064796 0.070220 0.046522 0.012545 0.012754 -0.096673 0.351422 0.093476 0.281967 0.022809 0.013228 -0.011534 0.001151 -0.124082 0.034960 0.085823 -0.086346 0.112091 0.201798
polarizability: 2.71355234e+02 5.21651861e+00 2.95432357e+02 -2.81663876e+01 2.18883702e+00 1.46570176e+02
1716.lowfreq: -9.0810 -0.0007 -0.0005 -0.0005 3.4000 6.3564 22.3293 24.2713 38.2447
frequency: 22.2475 24.1396 38.2299 41.9020 65.7144 88.6417 108.0291 136.6637 167.5419 179.6176 194.2258 200.8030 207.8023 212.2307 213.6348 237.6712 263.9154 289.2300 292.9795 322.8899 343.4567 352.0887 355.5301 385.3451 392.9640 399.2175 415.6070 457.2770 480.8670 485.0140 529.1684 560.0963 573.1996 593.7037 617.2906 627.0385 662.3280 697.4207 702.5787 744.3537 749.9298 754.4847 771.7655 791.7105 810.3118 844.9495 848.3841 850.2233 866.6022 894.6429 919.0569 955.2984 976.0868 986.4447 998.0332 1007.5191 1012.5058 1023.3901 1045.0761 1049.1126 1070.4648 1080.4750 1090.7988 1109.1496 1113.3400 1126.2999 1134.2198 1142.0214 1144.7056 1149.6041 1168.3143 1191.0704 1193.7631 1202.7970 1246.8389 1256.2023 1278.8134 1286.3738 1298.8002 1304.4274 1323.9412 1335.7882 1345.3760 1361.5182 1364.3603 1374.5202 1390.5238 1402.1000 1424.7924 1428.9440 1440.2317 1453.0049 1454.1060 1459.5439 1462.2255 1462.7346 1464.2910 1464.4846 1473.2659 1479.2695 1480.4143 1534.4201 1580.9874 1607.5592 1616.2889 1685.0736 2843.7336 2850.6495 2864.0771 2867.3815 2871.4339 2882.6993 2983.2334 2995.6637 3019.1655 3021.3672 3028.8396 3033.1151 3046.9328 3077.1230 3098.7009 3138.2970 3158.9201 3184.8952 3224.8525 3265.9466
redmass: 3.0984 4.5549 4.8000 2.8948 7.0817 3.9817 4.2768 5.3091 4.6363 2.3941 4.5469 3.6408 3.0962 1.6291 1.2808 3.8650 1.8671 3.0694 3.4456 2.1912 3.2740 7.8811 2.9446 6.0604 3.9344 2.7934 4.6007 4.8183 4.6097 3.9610 4.9123 4.4718 5.8907 3.4733 3.1936 5.2656 5.0882 6.6831 4.9438 6.7707 4.2814 1.5720 3.1590 3.7712 2.7378 2.1110 4.6683 1.7606 1.4443 6.9980 2.2927 5.3814 1.7005 2.3820 2.9818 2.2823 2.8125 2.8106 3.5251 1.6173 1.7592 1.8962 2.4601 1.2498 2.2236 1.6948 1.9286 2.3747 2.6742 2.8735 1.9762 1.1174 1.5654 1.4168 2.0576 1.6338 1.5348 1.5079 2.7812 1.3703 1.7541 1.6661 1.4077 2.7291 1.4880 1.4314 1.5309 2.8231 7.4346 1.1746 1.5816 1.0788 1.0821 1.0652 3.4899 1.0661 1.0962 1.0536 1.1001 1.0956 1.0545 5.7581 9.0231 9.5998 7.6344 10.7886 1.0706 1.0656 1.0641 1.0697 1.0674 1.0673 1.0880 1.0299 1.0733 1.0905 1.0874 1.0900 1.0888 1.1010 1.1050 1.1038 1.0887 1.0969 1.0919 1.1075
irintensity: 3.4467 0.1354 5.6668 0.2308 0.2448 1.3349 7.3222 0.1357 1.6265 1.4696 1.2727 0.4691 1.3407 0.0204 0.3465 1.0574 3.2468 0.4757 0.2567 12.1437 3.1132 2.9042 4.6024 3.2981 3.1819 3.4531 3.0659 5.1159 4.3148 2.3675 2.6792 3.1779 0.7039 2.1095 2.0414 5.8269 2.9953 24.2220 0.3506 28.4840 4.6376 71.1488 19.5588 1.7838 18.2280 21.8678 5.8374 6.0817 6.0968 14.1772 11.3118 65.9789 15.1498 21.7860 89.3406 15.4969 7.4441 11.9455 20.5400 7.0276 27.8591 17.3049 68.2371 0.0026 51.6902 23.0008 12.0915 78.8561 13.2570 51.8679 89.8428 2.6831 9.2369 0.2238 12.0894 6.1638 10.9482 25.7670 58.4026 2.4978 95.5541 10.3374 4.6200 22.1771 3.0499 6.8209 25.8989 79.3432 16.8570 1.8371 16.6372 0.0167 1.1140 33.9783 55.3451 20.8788 9.0848 14.1489 18.4766 7.1926 7.1704 2.3049 93.2883 58.6886 34.2666 611.4741 66.6328 38.4699 90.7697 17.2070 42.7238 294.6010 21.0097 55.4614 47.6939 36.4571 62.8740 45.5408 24.4312 33.4226 33.6043 18.7127 3.7644 4.7154 1.8918 0.3502
temp: 298.150 k
press: 1.00000 atm
elementType: 8 8 8 8 7 7 6 6 6 6 6 6 6 6 6 6 6 6 6 6 6 6 6 6 1 1 1 1 1 1 1 1 1 1 1 1 1 1 1 1 1 1 1 1
symmnumber: 1
zpe: 919649.9 jmol-1
zpe.correction: 0.350276 hartree
zpe.thermalcorrener: 0.371935 hartree
zpe.thermalcorrenthalpy: 0.372879 hartree
zpe.thermalcorrgfe: 0.298446 hartree
zpe.sumelectzpe: -1106.486259 hartree
zpe.sumelectthermal: -1106.464600 hartree
zpe.sumelectthermalent: -1106.463656 hartree
zpe.sumelectthermalfe: -1106.538089 hartree
dipole: 3.8040 -6.4116 -1.0872
dipole: 7.5340
quadrupole: -134.2380 -152.3270 -136.1135
quadrupole: 27.8264 -3.1295 -3.7882
quadrupole: 6.6549 -11.4342 4.7793 27.8264 -3.1295 -3.7882
hfenergy: -1106.836535 hartree
pointgroup: C01 [X(C18H20N2O4)]
dipole: 1.9915296 -1.9249669 -1.0555711 debye
polarizability: 265.2542346|7.6083512|290.6797169|-36.3403061|28.7548228|157.4238144 unknown
InChI: InChI=1S/C18H20N2O4/c1-19-6-8-20(9-7-19)11-14-12-3-4-15(21)24-17(12)18(22-2)16-13(14)5-10-23-16/h3-5,10H,6-9,11H2,1-2H3
charge 0 multiplicity 1
44 atoms
O  -2.074806 -3.329465 -0.212521
O  -2.776457 1.38084 0.942054
O  -3.803847 -1.058968 1.039151
O  -3.12801 3.599807 1.466412
N  2.423648 0.451534 -0.564741
N  4.989833 0.653928 0.761267
C  2.771439 -0.437965 0.572934
C  3.646531 0.84478 -1.310975
C  3.770509 0.2609 1.507307
C  4.641603 1.543325 -0.370513
C  1.39762 -0.138407 -1.468404
C  0.065097 -0.40892 -0.787668
C  -0.481543 -1.709531 -0.738564
C  -0.717049 0.638845 -0.21034
C  6.024726 1.235256 1.637648
C  -1.757497 -1.950076 -0.135216
C  -1.994321 0.366721 0.382985
C  -2.560265 -0.944477 0.440562
C  -0.011098 -3.012664 -1.199848
C  -0.274023 2.022745 -0.190077
C  -0.97397 -3.93589 -0.871777
C  -1.043188 3.026156 0.352395
C  -2.350106 2.774078 0.952027
C  -4.429144 -2.390609 1.159599
H  3.222371 -1.396376 0.211207
H  1.84841 -0.680708 1.128846
H  3.358954 1.53554 -2.126774
H  4.148014 -0.044075 -1.770016
H  3.268849 1.148155 1.972693
H  4.059717 -0.432177 2.319213
H  5.56489 1.788287 -0.928315
H  4.187041 2.504601 -0.015458
H  1.765878 -1.086612 -1.931141
H  1.254547 0.579426 -2.301665
H  6.292606 0.510815 2.427512
H  5.701846 2.185225 2.134561
H  6.934257 1.4497 1.048111
H  0.925413 -3.228884 -1.709011
H  0.719677 2.241842 -0.5903
H  -1.063026 -5.009937 -1.010236
H  -0.709542 4.066858 0.368084
H  -3.797652 -3.072271 1.754796
H  -4.616524 -2.831542 0.165642
H  -5.37861 -2.195409 1.678354
