program: Gaussian 09
title: 000150429
version: EM64L-G09RevD.01
frameworkgroup: C1[X(C14H10F2)]
method: RPBEPBE
basis: SDD
operation: Freq
keyword: #pfreq=noraman
keyword: PBEPBE/SDD
title: #p freq=noraman PBEPBE/SDD
converged: YES YES NO NO
title: Mulliken charges:
elementType: F F C C C C C C C C C C C C C C H H H H H H H H H H
charge: -0.206586 -0.206584 -0.398926 0.340734 0.340730 0.184050 0.184055 -0.696379 -0.603871 -0.603869 -0.360615 -0.360617 0.340261 0.340261 -0.387625 -0.387625 0.251091 0.236147 0.226090 0.226089 0.270504 0.270503 0.245272 0.245272 0.255820 0.255819
chargesum: 0.00000
title: Mulliken charges with hydrogens summed into heavy atoms:
elementType: F F C C C C C C C C C C C C C C
charge: -0.206586 -0.206584 -0.147835 0.340734 0.340730 0.184050 0.184055 -0.008054 -0.333367 -0.333366 -0.115343 -0.115345 0.340261 0.340261 -0.131805 -0.131806
polarizability: 2.30226498e+02 -4.16841372e-05 1.55994791e+02 4.04511615e-04 -8.28110861e+00 6.85955336e+01
1716.lowfreq: -6.8899 -0.0009 -0.0008 -0.0004 5.8535 8.3185 54.0117 107.7698 121.5710
frequency: 54.0108 107.7692 121.5671 151.0946 156.4956 223.7980 238.4575 269.6527 305.6986 339.0837 358.3815 391.8865 411.3605 456.6507 458.3613 501.6685 542.1686 563.9785 565.7667 597.8866 626.7089 686.9084 716.4811 724.5205 753.4720 766.5647 817.9999 830.8824 878.4837 879.6989 882.5762 903.1023 946.7151 947.5224 988.7902 995.1628 1047.9897 1063.1044 1107.1573 1108.1729 1128.6923 1133.4929 1196.1819 1207.1013 1210.4575 1249.7432 1268.7333 1272.8560 1297.8028 1378.5960 1380.7866 1388.0164 1437.3060 1437.4658 1454.8641 1475.4568 1475.7711 1488.6980 1596.0105 1597.0678 1619.9691 1623.3755 2965.0013 2984.5481 3080.0469 3092.2553 3139.1406 3141.9242 3158.7315 3159.1836 3176.2609 3176.7089
redmass: 7.9934 3.5697 4.6287 4.1505 7.5472 1.7230 1.5529 7.3072 11.5070 7.4638 3.8321 4.7200 5.2617 3.0946 3.3607 9.6736 3.7731 4.7864 4.8314 3.6719 5.0429 4.4866 5.5574 5.2653 3.1387 2.9153 1.3488 1.6948 2.2083 1.4589 2.1886 2.7854 1.4018 1.3403 2.1043 7.1571 1.4940 2.2775 1.7684 1.4731 1.7897 1.4437 2.1050 1.9043 2.3670 1.8372 1.5366 1.5193 2.9975 10.0620 3.0147 1.3364 5.0481 3.7472 2.6798 1.1148 1.0483 4.6492 8.0888 7.7452 7.6735 7.3959 1.0818 1.0347 1.1002 1.1013 1.0901 1.0900 1.0930 1.0932 1.0956 1.0958
irintensity: 1.0167 1.1086 0.0042 0.0512 0.9893 0.2156 0.0528 3.8778 0.0766 0.3625 0.3108 0.0001 5.6580 18.9074 0.1095 33.7509 0.0000 1.4469 2.7217 0.0511 0.5402 1.7823 11.0391 2.2845 8.4160 0.1426 88.9555 0.0215 33.4800 1.3591 23.1197 66.6122 0.0004 0.0838 1.0650 2.5899 3.5255 1.6493 3.6957 34.9031 7.6610 17.3440 1.7829 75.6491 9.3011 6.8917 0.8494 22.2561 2.0303 20.7395 1.5222 8.6298 7.3227 92.3011 135.1371 1.1821 15.7529 5.6352 28.2344 13.2145 40.0226 1.7817 8.2608 32.7221 24.7233 25.4677 3.3922 13.2254 3.6338 1.9103 6.9917 4.2463
temp: 298.150 k
press: 1.00000 atm
elementType: 9 9 6 6 6 6 6 6 6 6 6 6 6 6 6 6 1 1 1 1 1 1 1 1 1 1
symmnumber: 1
zpe: 513676.5 jmol-1
zpe.correction: 0.195649 hartree
zpe.thermalcorrener: 0.208206 hartree
zpe.thermalcorrenthalpy: 0.209150 hartree
zpe.thermalcorrgfe: 0.156885 hartree
zpe.sumelectzpe: -738.091804 hartree
zpe.sumelectthermal: -738.079247 hartree
zpe.sumelectthermalent: -738.078303 hartree
zpe.sumelectthermalfe: -738.130568 hartree
dipole: 0.0000 -0.0376 0.0927
dipole: 0.1000
quadrupole: -112.9079 -75.9438 -94.4083
quadrupole: 0.0000 0.0001 -2.5436
quadrupole: -18.4879 18.4762 0.0117 0.0000 0.0001 -2.5436
hfenergy: -738.2874533 hartree
pointgroup: C01 [X(C14H10F2)]
dipole: 0.0000126 0.0152254 -0.0362798 debye
dipolederiv: -1.3380599 -0.1223918 0.0248514 -0.2237946 -0.233661 0.0106707 0.0244838 0.0101585 -0.1531746 -1.3380568 0.1224185 -0.0248783 0.2238198 -0.2336672 0.010677 -0.0245386 0.010168 -0.1531748 0.0851677 -0.0000016 -0.0000032 -0.000001 -0.0869363 -0.0127298 -0.0000022 -0.0033585 0.1506736 -0.0062503 -0.0982225 -0.0096512 -0.2307266 0.1247897 -0.0309248 0.0469171 -0.0916889 -0.0649955 -0.0062427 0.09823 0.0096564 0.230727 0.1247866 -0.0309209 -0.0469292 -0.091661 -0.0649994 0.2292003 -0.0865643 0.015276 0.1262083 -0.1711429 0.0103231 -0.0252033 0.0309632 -0.0037416 0.2291944 0.0865554 -0.0152698 -0.126217 -0.1711438 0.0103208 0.0252221 0.030961 -0.0037412 -0.0070926 0.0000013 0.0000005 0.0000032 0.0905909 -0.0482969 -0.0000012 0.0441089 0.0584835 -0.1896876 0.0528545 0.0043392 0.1880985 -0.0280534 -0.0218823 -0.0222226 -0.0093193 -0.1543016 -0.1896966 -0.0528526 -0.0043515 -0.1880983 -0.028047 -0.0218861 0.0222128 -0.0093232 -0.1543019 0.0914609 -0.0083241 0.0032453 0.0268081 0.1062577 -0.0362754 -0.0007781 -0.0304744 -0.133813 0.0914627 0.0083254 -0.0032452 -0.0268049 0.1062568 -0.0362841 0.0007682 -0.0304873 -0.1338103 1.2984584 0.108703 -0.0220511 0.3508878 0.3252128 -0.0299852 -0.0383052 -0.0311895 0.082038 1.298457 -0.1087249 0.0220839 -0.3509079 0.3252234 -0.0299964 0.038385 -0.0312087 0.0820431 -0.2639775 -0.0186404 0.0054276 -0.3349567 -0.0975017 -0.0131272 0.0429683 -0.008027 -0.1596962 -0.2639712 0.0186446 -0.005431 0.3349627 -0.0975099 -0.0131215 -0.0429818 -0.0080194 -0.1596988 -0.0073825 -0.0000002 0.0000042 -0.0000017 0.0312331 0.0640669 0.0000027 0.0605238 -0.0680612 0.0910113 -0.0000004 0.000003 -0.0000018 0.0530126 0.1000214 0.0000027 0.0241466 -0.0952629 -0.065563 0.1655674 -0.014517 0.1073009 -0.0123151 -0.0106052 -0.0246945 -0.0024486 0.0708415 -0.0655707 -0.1655682 0.0145128 -0.1073002 -0.0123129 -0.0106078 0.0246903 -0.0024538 0.0708432 0.0871312 -0.024231 -0.0014366 -0.0679222 -0.0244845 0.0256202 -0.000455 0.0219714 0.168055 0.087134 0.0242276 0.0014382 0.0679208 -0.0244891 0.0256235 0.0004591 0.0219734 0.1680544 0.0728345 -0.0765801 0.0102414 -0.0398044 -0.0634632 0.025499 0.0055098 0.0272933 0.1477335 0.0728382 0.076574 -0.0102435 0.0398009 -0.0634648 0.025505 -0.0055042 0.0273027 0.1477317 0.0036027 0.0722416 -0.0095566 0.0821002 0.0304131 0.0191581 -0.0120561 0.0200455 0.1781376 0.0035981 -0.0722411 0.0095549 -0.082101 0.030416 0.0191579 0.0120502 0.0200433 0.1781378 unknown
polarizability: 230.2264985|-0.000806|156.1729876|0.0011316|-7.2781003|68.4173369 unknown
InChI: InChI=1S/C14H10F2/c1-8-13-6-9(15)2-4-11(13)12-5-3-10(16)7-14(8)12/h2-8H,1H3
charge 0 multiplicity 1
26 atoms
F  -4.841074 -0.157004 0.080583
F  4.841048 -0.157119 0.080693
C  -0.00003 -1.608848 0.292196
C  -1.188707 -0.655241 0.161029
C  1.18867 -0.655264 0.161093
C  -0.737619 0.689426 -0.013371
C  0.737621 0.68941 -0.013338
C  -0.000016 -2.760753 -0.74898
C  -2.560658 -0.957265 0.194566
C  2.560616 -0.957321 0.194635
C  -1.666742 1.745243 -0.152653
C  1.66677 1.745201 -0.15264
C  -3.457265 0.120005 0.050584
C  3.457252 0.11992 0.050642
C  -3.0505 1.457183 -0.120194
C  3.050522 1.457106 -0.120158
H  -0.000058 -2.064314 1.305204
H  -0.000004 -2.358027 -1.776974
H  0.893061 -3.399342 -0.625562
H  -0.893111 -3.39933 -0.625591
H  -2.942426 -1.974356 0.325847
H  2.942348 -1.974424 0.325925
H  -1.332131 2.779587 -0.285608
H  1.332194 2.779553 -0.285633
H  -3.80555 2.241735 -0.22437
H  3.805591 2.24164 -0.224327
