program: Gaussian 09
title: 000150396
version: EM64L-G09RevD.01
frameworkgroup: C1[X(C11H8N4O4S)]
method: RPBEPBE
basis: SDD
operation: Freq
keyword: #p
keyword: freq=noraman
keyword: PBEPBE/SDD
title: #p freq=noraman PBEPBE/SDD
converged: YES YES NO NO
title: Mulliken charges:
elementType: S O O O O N N N N C C C C C C C C C C C H H H H H H H H
charge: 0.308855 -0.204991 -0.232074 -0.191024 -0.209346 -0.166833 -0.033002 0.041675 0.021202 -0.296852 -0.212592 0.254626 -0.683492 0.064659 0.286621 0.246035 -0.342770 -0.371605 -0.238536 -0.208865 0.285900 0.264020 0.278189 0.302733 0.266156 0.284765 0.241861 0.244682
chargesum: 0.00000
title: Mulliken charges with hydrogens summed into heavy atoms:
elementType: S O O O O N N N N C C C C C C C C C C C
charge: 0.308855 -0.204991 -0.232074 -0.191024 -0.209346 -0.166833 -0.033002 0.041675 0.021202 0.253068 -0.212592 0.254626 -0.102569 0.064659 0.286621 0.246035 -0.076614 -0.086840 0.003325 0.035817
polarizability: 2.75442037e+02 5.95800604e+00 1.95511157e+02 1.37650780e+01 2.56540183e+00 1.05930430e+02
1716.lowfreq: -7.3398 -0.0006 0.0013 0.0013 3.7232 6.6018 30.8219 52.8882 61.1046
frequency: 30.7432 52.8853 61.1015 76.9196 91.8145 111.4101 134.9603 138.9221 172.6943 176.4075 219.0201 244.5551 269.4781 280.3097 351.3625 367.0704 383.7387 404.7784 429.8211 461.3491 484.2962 532.3552 566.8742 611.1044 624.5283 637.0970 660.2298 672.4215 677.4447 689.5871 715.7984 744.3278 751.0277 765.9931 784.2413 805.5215 859.2622 893.1431 965.5666 974.4644 987.6212 1000.4574 1012.4462 1039.5335 1056.7974 1107.8003 1123.9845 1143.0924 1170.0925 1176.2784 1185.1085 1217.7103 1231.4253 1261.6605 1272.1119 1290.6911 1303.1454 1329.0312 1347.6184 1372.3127 1383.5961 1390.3308 1422.2560 1431.3652 1453.8895 1456.2380 1481.2807 1528.6880 1576.4281 1614.7798 3026.7524 3062.3682 3118.0550 3145.7529 3149.8784 3161.4058 3174.3932 3186.8790
redmass: 9.9741 6.0962 10.5136 8.5345 5.8044 6.0960 7.6900 2.8512 8.7404 6.6899 5.5010 6.2912 6.0315 9.8475 8.6862 13.2845 9.2715 5.4281 5.6106 6.2997 6.1856 5.8509 7.7604 5.8820 8.3212 6.6370 6.0201 7.0911 6.9352 4.2152 7.0090 4.9974 7.0465 8.1448 1.4186 8.2384 1.8278 1.3979 3.4664 1.4120 4.0437 1.3487 1.4710 3.0031 3.8966 4.9147 3.9680 1.9268 1.3481 1.0795 1.2529 11.4574 5.3312 1.7334 1.6219 1.5819 3.7709 10.8133 7.8862 10.5923 5.1300 2.8164 7.8761 2.6666 1.3578 1.9208 1.1437 6.7921 6.3462 7.4655 1.0658 1.0589 1.0995 1.0867 1.1095 1.0915 1.0964 1.0977
irintensity: 0.8483 4.7037 1.3501 3.1158 3.2187 1.5077 0.1185 0.1809 4.2450 8.1228 1.9270 0.7116 1.7147 3.8051 2.0138 1.1228 0.8952 0.3402 1.1689 0.8180 1.8531 1.6315 4.9229 5.4809 4.2709 4.4704 4.8841 24.9764 2.8735 2.6924 11.6922 0.4340 15.2729 8.1501 61.2881 7.9906 4.6165 1.6960 3.4303 2.1027 1.3553 1.6190 1.6618 1.6084 22.3653 44.4384 66.4923 15.3366 5.6969 2.4844 18.1686 160.6617 106.5818 78.3912 1.3662 34.8631 115.5081 195.2499 153.4761 247.4788 10.5742 5.1235 148.3720 10.0413 29.9905 53.7641 14.7179 35.3997 9.6558 1.2557 13.1469 16.0390 3.1486 2.5858 5.2724 10.6815 6.6345 8.2135
temp: 298.150 k
press: 1.00000 atm
elementType: 16 8 8 8 8 7 7 7 7 6 6 6 6 6 6 6 6 6 6 6 1 1 1 1 1 1 1 1
symmnumber: 1
zpe: 492071.2 jmol-1
zpe.correction: 0.187420 hartree
zpe.thermalcorrener: 0.204103 hartree
zpe.thermalcorrenthalpy: 0.205047 hartree
zpe.thermalcorrgfe: 0.141760 hartree
zpe.sumelectzpe: -1340.331043 hartree
zpe.sumelectthermal: -1340.314360 hartree
zpe.sumelectthermalent: -1340.313416 hartree
zpe.sumelectthermalfe: -1340.376703 hartree
dipole: 3.5511 -4.3355 -1.6226
dipole: 5.8344
quadrupole: -85.0239 -134.8147 -126.7334
quadrupole: 18.7005 3.9154 7.0354
quadrupole: 30.5001 -19.2907 -11.2094 18.7005 3.9154 7.0354
hfenergy: -1340.518463 hartree
pointgroup: C01 [X(C11H8N4O4S1)]
dipole: -1.1659858 -0.0981573 -1.9747893 debye
polarizability: 275.5797153|-14.9864307|112.3092805|0.3969246|-22.9267574|188.9946287 unknown
InChI: InChI=1S/C11H8N4O4S/c16-14(17)8-4-2-1-3-7(8)9-10(15(18)19)13-5-6-20-11(13)12-9/h1-4H,5-6H2
charge 0 multiplicity 1
28 atoms
S  -3.736044 1.148621 -1.906302
O  0.39289 -1.745233 1.744357
O  -1.875056 -1.97901 2.02489
O  2.657667 0.589153 2.702747
O  0.67263 1.293549 1.843341
N  -2.352834 -0.198189 -0.054128
N  -0.899124 0.782349 -1.509472
N  -0.832621 -1.466248 1.427124
N  1.826238 0.725764 1.728919
C  -3.734146 -0.559322 0.331039
C  -2.192654 0.598014 -1.171042
C  -1.060988 -0.567624 0.34973
C  -4.628849 0.530657 -0.315484
C  -0.166215 0.07452 -0.547808
C  1.307618 0.027254 -0.661925
C  2.24702 0.248637 0.383193
C  1.832579 -0.272087 -1.947075
C  3.636294 0.116909 0.179154
C  3.220286 -0.388639 -2.17004
C  4.126714 -0.210226 -1.1004
H  -3.838491 -0.57191 1.425332
H  -3.968555 -1.56883 -0.051016
H  -5.609321 0.134709 -0.614285
H  -4.748007 1.405987 0.339953
H  1.125428 -0.417796 -2.768946
H  4.30709 0.287866 1.024986
H  3.590259 -0.623322 -3.173295
H  5.204593 -0.308851 -1.262146
