program: Gaussian 09
title: 000150358
version: EM64L-G09RevD.01
frameworkgroup: C1[X(C20H10N2O4)]
method: RPBEPBE
basis: SDD
operation: Freq
keyword: #p
keyword: freq=noraman
keyword: PBEPBE/SDD
title: #p freq=noraman PBEPBE/SDD
converged: YES YES NO YES
title: Mulliken charges:
elementType: O O O O N N C C C C C C C C C C C C C C C C C C C C H H H H H H H H H H
charge: -0.159047 -0.159010 -0.168846 -0.168788 -0.065091 -0.033555 -0.097017 -0.141262 0.182795 0.372214 0.289471 0.256732 0.279574 0.480578 0.249614 -0.421489 -0.397071 -0.388118 0.259361 -0.415429 -0.468740 -0.470711 -0.426459 -0.340428 -0.290292 -0.275724 0.241930 0.265622 0.233901 0.262596 0.254353 0.250661 0.263759 0.258033 0.245341 0.240542
chargesum: 0.00000
title: Mulliken charges with hydrogens summed into heavy atoms:
elementType: O O O O N N C C C C C C C C C C C C C C C C C C C C
charge: -0.159047 -0.159010 -0.168846 -0.168788 -0.065091 -0.033555 -0.097017 -0.141262 0.182795 0.372214 0.289471 0.256732 0.279574 0.480578 0.249614 -0.179559 -0.131449 -0.154217 0.259361 -0.152833 -0.214388 -0.220051 -0.162699 -0.082395 -0.044951 -0.035182
polarizability: 4.05181376e+02 -2.67572054e+01 3.16550577e+02 -8.42165920e-03 -2.47547483e-02 1.21229196e+02
1716.lowfreq: -79.8965 -49.3250 -7.7133 -5.1911 0.0000 0.0007 0.0009 6.7694 34.9777
frequency: -79.8956 -49.3213 34.9655 50.6848 66.2563 111.3574 116.0027 144.2782 160.9275 180.9549 203.2919 225.9088 234.5147 274.0057 298.5980 300.0733 367.6264 379.4925 404.9451 410.4862 442.3319 443.1689 476.5857 476.9129 528.6827 532.0581 541.6423 563.4141 564.1183 585.5967 612.2064 635.2326 637.9688 672.7882 692.8089 695.1887 708.5656 739.8260 743.2387 747.3741 753.1009 773.7742 787.7030 793.1901 798.1463 839.4452 851.0715 851.3514 878.8160 881.5592 915.5080 948.7335 953.1627 959.8093 981.5250 991.8516 999.2953 1072.9493 1089.2478 1134.2735 1146.3061 1160.7637 1169.8078 1191.3163 1207.9287 1213.6429 1235.6202 1239.0911 1253.2518 1260.7490 1273.7577 1307.7346 1340.8639 1350.8050 1369.3096 1370.5247 1375.0737 1389.7243 1400.7125 1407.7931 1422.0377 1438.8635 1447.5102 1478.0745 1509.4216 1526.2184 1560.9791 1586.9149 1598.5659 1602.4229 1615.3120 1623.7871 3136.0566 3146.2751 3148.0682 3153.5826 3161.1703 3169.8194 3170.2263 3172.4522 3184.4001 3263.9643
redmass: 12.0409 8.0665 5.8980 7.8970 8.7928 4.8508 13.4564 4.3386 10.7693 4.3274 6.1194 5.0919 8.5248 8.4303 5.7633 7.7087 7.5603 4.9076 4.7075 6.1760 6.2359 3.1666 5.9273 4.7734 3.8535 6.9404 7.7170 3.9184 6.3726 4.3163 9.0099 9.2018 3.2552 4.1571 9.8249 3.7676 8.7401 9.4572 2.0821 9.7446 2.2538 6.0014 6.8570 1.6175 2.9444 1.4484 2.0964 7.0856 7.3145 1.5152 1.4601 1.3808 6.0614 1.3860 1.3634 1.3862 4.6972 5.5318 2.8286 2.0473 2.1902 1.8398 1.4415 2.3703 1.3835 1.4396 1.9755 1.9320 4.2534 5.2554 3.0029 2.3371 2.9795 5.2087 2.2170 14.3374 14.5434 5.5349 5.9082 7.0752 2.6915 2.4265 2.6958 2.6491 4.8047 4.7312 5.5934 6.5345 5.9235 6.5227 5.6563 7.0977 1.0872 1.0880 1.0877 1.0918 1.0906 1.0983 1.0985 1.0982 1.0931 1.0895
irintensity: 0.0169 0.9175 0.0002 0.3454 0.5638 0.6867 1.1187 1.4550 6.8990 6.0268 0.4994 0.1431 2.0651 0.6971 0.0559 4.4540 0.6971 0.0080 0.0128 1.1656 5.6522 0.2799 3.3128 2.1769 3.8218 0.3423 8.3079 3.2354 1.4657 0.6048 11.0218 14.2505 0.0547 0.7611 11.9306 20.0724 0.5798 27.3428 10.4997 19.2334 11.4244 2.1420 1.0244 12.3972 13.4595 90.7490 35.5243 8.5867 2.8110 3.2332 0.7703 0.0272 0.7998 1.5629 0.8066 1.2074 1.2122 2.9607 0.2714 10.5753 11.4858 0.7385 1.1069 25.7219 11.8610 0.9225 5.9161 14.8215 86.8520 81.1997 25.0354 10.2727 13.9192 0.5376 29.9032 134.4284 198.8582 1.1054 3.4848 0.2895 5.3976 1.0883 0.6175 0.4928 8.6231 1.8136 2.1082 13.9594 1.2742 6.3813 2.7918 0.5819 0.6159 0.5253 2.6444 21.8066 1.0765 13.7985 5.3102 12.7541 13.1885 0.5025
temp: 298.150 k
press: 1.00000 atm
elementType: 8 8 8 8 7 7 6 6 6 6 6 6 6 6 6 6 6 6 6 6 6 6 6 6 6 6 1 1 1 1 1 1 1 1 1 1
symmnumber: 1
zpe: 658182.3 jmol-1
zpe.correction: 0.250688 hartree
zpe.thermalcorrener: 0.268223 hartree
zpe.thermalcorrenthalpy: 0.269167 hartree
zpe.thermalcorrgfe: 0.205171 hartree
zpe.sumelectzpe: -1176.656672 hartree
zpe.sumelectthermal: -1176.639138 hartree
zpe.sumelectthermalent: -1176.638193 hartree
zpe.sumelectthermalfe: -1176.702190 hartree
dipole: -3.8717 5.3377 -0.0003
dipole: 6.5940
quadrupole: -154.9893 -133.3427 -160.8040
quadrupole: -8.7468 0.0032 0.0138
quadrupole: -5.2773 16.3693 -11.0920 -8.7468 0.0032 0.0138
hfenergy: -1176.9073602 hartree
pointgroup: C01 [X(C20H10N2O4)]
dipole: -1.5783495 -2.0589194 0.0000986 debye
polarizability: 406.5368778|24.3715297|315.1950756|0.0077626|-0.0249692|121.2291964 unknown
InChI: InChI=1S/C20H10N2O4/c23-21(24)16-10-8-13-12-4-1-3-11-7-9-17(22(25)26)20(18(11)12)15-6-2-5-14(16)19(13)15/h1-10H
charge 0 multiplicity 1
36 atoms
O  -2.687381 3.370208 1.141864
O  -2.687317 3.370151 -1.141838
O  5.383366 0.21012 -1.142814
O  5.385222 0.204571 1.142279
N  -2.656732 2.772588 0.000027
N  4.819389 0.016172 -0.000269
C  0.985738 0.019412 -0.000036
C  -1.745014 -0.96068 0.00005
C  -1.508262 0.476127 0.000112
C  -0.104505 0.977466 0.000171
C  0.743179 -1.403763 -0.000147
C  -0.648234 -1.901229 -0.000018
C  2.355031 0.502427 -0.000111
C  -3.098381 -1.485924 0.000063
C  -2.671678 1.283093 0.000059
C  1.84147 -2.290476 -0.000349
C  0.228972 2.350443 0.000414
C  -0.931704 -3.284439 0.000039
C  3.410957 -0.4611 -0.000263
C  2.630936 1.90477 0.000041
C  -4.213339 -0.591571 0.000037
C  -3.331122 -2.896368 0.000089
C  3.179207 -1.831429 -0.000335
C  -4.000757 0.778831 0.000008
C  1.572471 2.807171 0.000343
C  -2.25698 -3.785493 0.0001
H  1.682823 -3.370314 -0.00049
H  -0.527735 3.128042 0.000704
H  -0.115941 -4.010965 0.000042
H  3.664832 2.263121 -0.000102
H  -5.230049 -0.997183 0.000022
H  -4.36413 -3.260735 0.000103
H  4.012279 -2.539985 -0.000392
H  -4.837327 1.483718 -0.000047
H  1.764737 3.884282 0.000502
H  -2.427821 -4.866561 0.000143
